-
Get Python Wheel pgAdmin4
wget https://ftp.postgresql.org/pub/pgadmin/pgadmin4/v2.0/pip/pgadmin4-2.0-py2.py3-none-any.whl
-
Install pip3
sudo apt install python3-pip
-
Install virtualenv
sudo pip3 install virtualenv
-
Create virtualenv in dir ~/py3-venv-pgadmin
virtualenv --system-site-packages --no-setuptools --python=python3.5 ~/py3-venv-pgadmin
-
Activate virtualenv
cd ~/py3-venv-pgadmin/bin source activate
-
Check pip3
which pip3 ~/py3-venv-pgadmin/bin/pip3
-
Install pgAdmin4
pip3 install pgadmin4-2.0-py2.py3-none-any.whl
-
cd ~/py3-venv-pgadmin/lib/python3.5/site-packages/pgadmin4 touch config_local.py nano config_local.py
write:
import os SERVER_MODE = False DATA_DIR = os.path.realpath(os.path.expanduser(u'~/.pgadmin/')) LOG_FILE = os.path.join(DATA_DIR, 'pgadmin4.log') SQLITE_PATH = os.path.join(DATA_DIR, 'pgadmin4.db') SESSION_DB_PATH = os.path.join(DATA_DIR, 'sessions') STORAGE_DIR = os.path.join(DATA_DIR, 'storage')
run:
python3 ~/py3-venv-pgadmin/lib/python3.5/site-packages/pgadmin4/setup.py
-
Run pgAdmin4
python3 ~/py3-venv-pgadmin/lib/python3.5/site-packages/pgadmin4/pgAdmin4.py
-
Exit virtualenv
deactivate
-
For run pgadmin4 create script ~/py3-venv-pgadmin/pgadmin4.sh
#!/usr/bin/env bash cd ~/py3-venv-pgadmin/bin source activate python3 ~/py3-venv-pgadmin/lib/python3.5/site-packages/pgadmin4/pgAdmin4.py
-
Create alias for bash
nano ~/.bashrc
write at the end of file:
alias pgadmin4='~/py3-venv-pgadmin/pgadmin4.sh'
reload bashrc
source ~/.bashrc
now you can run pgadmin
pgadmin4
-
-
Save Prototype-X/fd8bf6d8b929224621613316bf37db02 to your computer and use it in GitHub Desktop.
wget https://ftp.postgresql.org/pub/pgadmin/pgadmin4/v1.6/source/pgadmin4-1.6.tar.gz
with pgadmin4-2, I get following error:
(py3-venv-pgadmin) tristan@gouda:~/apps/pgadmin4-2.0/web$ python3 setup.py
python3 setup.py
Traceback (most recent call last):
File "setup.py", line 46, in <module>
create_app_data_directory(config)
File "/home/tristan/apps/pgadmin4-2.0/web/pgadmin/setup/data_directory.py", line 23, in create_app_data_directory
_create_directory_if_not_exists(os.path.dirname(config.SQLITE_PATH))
File "/home/tristan/apps/pgadmin4-2.0/web/pgadmin/setup/data_directory.py", line 15, in _create_directory_if_not_exists
os.mkdir(_path)
PermissionError: [Errno 13] Permission denied: '/var/lib/pgadmin'
Same here... for pgadmin4-2.0: PermissionError: [Errno 13] Permission denied: '/var/lib/pgadmin'
As a work around create the folders manually:-
sudo mkdir /var/lib/pgadmin
sudo mkdir /var/log/pgadmin
sudo mkdir /var/lib/pgadmin/sessions
sudo mkdir /var/lib/pgadmin/storage
And give permissions to the folders
sudo chmod 777 -R /var/log/pgadmin/
sudo chmod 777 -R /var/lib/pgadmin/
It may not be the best workaround, but i was able to make it work :)
Thank you very much.
The installation of pgadmin4 is always very difficult.
But your method works
But on another computer, there is no ~/py3-venv-pgadmin/lib/python3.5/site-packages/pgadmin4 created
As usual, install of pgadmin4 is a nigthmare. I am afraid for the future of PostgreSQL
Hi, @mmmchl
You can easy install it without virtualenv, just run
sudo pip3 install pgadmin4-2.0-py2.py3-none-any.whl
pgadmin4 path something like: /usr/lib/python3/dist-packages/pgadmin4
@hareeshmu set DATA_DIR with the path that you need. Example: DATA_DIR = '/home/user/test'
Hi, Prototype-X@@
I appreciate! You saved me lot of time
Works great, thank you! But how is it even possible that there is no official .deb package for pgadmin4? Especially now after PostgreSQL 10 went stable and pgadmin3 doesn't work at all any more. This brings back memories of Slackware Linux 20 years ago when you had to download and compile most everything manually. Please Postgres, shape up!
Great explanation! Thanks a lot!
Thanks Prototype-X
How about upgrading steps 1 and 7 for the latest version of pgAdmin 4.2.1?
Step 1. to
wget https://ftp.postgresql.org/pub/pgadmin/pgadmin4/v2.1/pip/pgadmin4-2.1-py2.py3-none-any.whl
Step 7. to
pip3 install pgadmin4-2.1-py2.py3-none-any.whl
I get the folllowing
(py3-venv-pgadmin) hutber@hutber-blade ~/py3-venv-pgadmin/bin $ pip3 install pgadmin4-2.1-py2.py3-none-any.whl
Processing ./pgadmin4-2.1-py2.py3-none-any.whl
Collecting Flask-HTMLmin; python_version >= "2.7" (from pgadmin4==2.1)
Downloading Flask-HTMLmin-1.3.1.tar.gz
Could not import setuptools which is required to install from a source distribution.
Please install setuptools.
In the step 12 for zsh users have to use: ~/.zshrc
instead of ~/.bashrc
Using the alias in step 12 returned this error: /home/veegish/py3-venv-pgadmin/pgadmin4.sh: Permission denied
. To fix this I edited .bashrc
with the following: alias pgadmin4='sh ~/py3-venv-pgadmin/pgadmin4.sh'
, which allowed the script to be executed using that alias. Another way is to make the script executable by running chmod +x pgadmin4.sh
@osparking (and others).
Tried to repeat step 1 & 7, for upgrading from 4.2.0 to 4.2.1. Didn't succeed, pgadmin4 was still 4.2.0.
After that, also included the virtualenv activation, so repeated steps 1, 5, 7, 10. After that everything worked out well!
Failed building wheel for pycrypto
Running setup.py clean for pycrypto
Failed to build pycrypto
testtools 2.3.0 has requirement extras>=1.0.0, but you'll have extras 0.0.3 which is incompatible.
Installing collected packages: pycrypto, extras, blinker, Flask-Principal, Babel, Flask-Babel, pbr, six, linecache2, traceback2, unittest2, python-mimeparse, testtools, fixtures, beautifulsoup4, Flask-Login, Flask-Gravatar, SQLAlchemy, Flask-SQLAlchemy, importlib, simplejson, passlib, Flask-Mail, Flask-Security, backports.csv, html5lib, sqlparse, htmlmin, Flask-HTMLmin, Flask-Paranoid, python-dateutil, Flask-Script, Mako, python-editor, alembic, Flask-Migrate, speaklater, pyrsistent, pgadmin4
Running setup.py install for pycrypto ... error
Complete output from command /home/pruthvi/pgAdmin4/pgAdmin4/bin/python2 -u -c "import setuptools, tokenize;file='/tmp/pip-install-pnCtdC/pycrypto/setup.py';f=getattr(tokenize, 'open', open)(file);code=f.read().replace('\r\n', '\n');f.close();exec(compile(code, file, 'exec'))" install --record /tmp/pip-record-vQSO23/install-record.txt --single-version-externally-managed --compile --install-headers /home/pruthvi/pgAdmin4/pgAdmin4/include/site/python2.7/pycrypto:
running install
running build
running build_py
creating build
creating build/lib.linux-x86_64-2.7
creating build/lib.linux-x86_64-2.7/Crypto
copying lib/Crypto/init.py -> build/lib.linux-x86_64-2.7/Crypto
copying lib/Crypto/pct_warnings.py -> build/lib.linux-x86_64-2.7/Crypto
creating build/lib.linux-x86_64-2.7/Crypto/Hash
copying lib/Crypto/Hash/MD4.py -> build/lib.linux-x86_64-2.7/Crypto/Hash
copying lib/Crypto/Hash/SHA224.py -> build/lib.linux-x86_64-2.7/Crypto/Hash
copying lib/Crypto/Hash/init.py -> build/lib.linux-x86_64-2.7/Crypto/Hash
copying lib/Crypto/Hash/SHA256.py -> build/lib.linux-x86_64-2.7/Crypto/Hash
copying lib/Crypto/Hash/MD2.py -> build/lib.linux-x86_64-2.7/Crypto/Hash
copying lib/Crypto/Hash/RIPEMD.py -> build/lib.linux-x86_64-2.7/Crypto/Hash
copying lib/Crypto/Hash/SHA384.py -> build/lib.linux-x86_64-2.7/Crypto/Hash
copying lib/Crypto/Hash/hashalgo.py -> build/lib.linux-x86_64-2.7/Crypto/Hash
copying lib/Crypto/Hash/HMAC.py -> build/lib.linux-x86_64-2.7/Crypto/Hash
copying lib/Crypto/Hash/MD5.py -> build/lib.linux-x86_64-2.7/Crypto/Hash
copying lib/Crypto/Hash/SHA512.py -> build/lib.linux-x86_64-2.7/Crypto/Hash
copying lib/Crypto/Hash/SHA.py -> build/lib.linux-x86_64-2.7/Crypto/Hash
creating build/lib.linux-x86_64-2.7/Crypto/Cipher
copying lib/Crypto/Cipher/CAST.py -> build/lib.linux-x86_64-2.7/Crypto/Cipher
copying lib/Crypto/Cipher/DES.py -> build/lib.linux-x86_64-2.7/Crypto/Cipher
copying lib/Crypto/Cipher/init.py -> build/lib.linux-x86_64-2.7/Crypto/Cipher
copying lib/Crypto/Cipher/ARC2.py -> build/lib.linux-x86_64-2.7/Crypto/Cipher
copying lib/Crypto/Cipher/ARC4.py -> build/lib.linux-x86_64-2.7/Crypto/Cipher
copying lib/Crypto/Cipher/Blowfish.py -> build/lib.linux-x86_64-2.7/Crypto/Cipher
copying lib/Crypto/Cipher/DES3.py -> build/lib.linux-x86_64-2.7/Crypto/Cipher
copying lib/Crypto/Cipher/blockalgo.py -> build/lib.linux-x86_64-2.7/Crypto/Cipher
copying lib/Crypto/Cipher/XOR.py -> build/lib.linux-x86_64-2.7/Crypto/Cipher
copying lib/Crypto/Cipher/PKCS1_v1_5.py -> build/lib.linux-x86_64-2.7/Crypto/Cipher
copying lib/Crypto/Cipher/AES.py -> build/lib.linux-x86_64-2.7/Crypto/Cipher
copying lib/Crypto/Cipher/PKCS1_OAEP.py -> build/lib.linux-x86_64-2.7/Crypto/Cipher
creating build/lib.linux-x86_64-2.7/Crypto/Util
copying lib/Crypto/Util/py21compat.py -> build/lib.linux-x86_64-2.7/Crypto/Util
copying lib/Crypto/Util/winrandom.py -> build/lib.linux-x86_64-2.7/Crypto/Util
copying lib/Crypto/Util/Counter.py -> build/lib.linux-x86_64-2.7/Crypto/Util
copying lib/Crypto/Util/init.py -> build/lib.linux-x86_64-2.7/Crypto/Util
copying lib/Crypto/Util/py3compat.py -> build/lib.linux-x86_64-2.7/Crypto/Util
copying lib/Crypto/Util/RFC1751.py -> build/lib.linux-x86_64-2.7/Crypto/Util
copying lib/Crypto/Util/randpool.py -> build/lib.linux-x86_64-2.7/Crypto/Util
copying lib/Crypto/Util/_number_new.py -> build/lib.linux-x86_64-2.7/Crypto/Util
copying lib/Crypto/Util/number.py -> build/lib.linux-x86_64-2.7/Crypto/Util
copying lib/Crypto/Util/asn1.py -> build/lib.linux-x86_64-2.7/Crypto/Util
creating build/lib.linux-x86_64-2.7/Crypto/Random
copying lib/Crypto/Random/init.py -> build/lib.linux-x86_64-2.7/Crypto/Random
copying lib/Crypto/Random/_UserFriendlyRNG.py -> build/lib.linux-x86_64-2.7/Crypto/Random
copying lib/Crypto/Random/random.py -> build/lib.linux-x86_64-2.7/Crypto/Random
creating build/lib.linux-x86_64-2.7/Crypto/Random/Fortuna
copying lib/Crypto/Random/Fortuna/SHAd256.py -> build/lib.linux-x86_64-2.7/Crypto/Random/Fortuna
copying lib/Crypto/Random/Fortuna/init.py -> build/lib.linux-x86_64-2.7/Crypto/Random/Fortuna
copying lib/Crypto/Random/Fortuna/FortunaAccumulator.py -> build/lib.linux-x86_64-2.7/Crypto/Random/Fortuna
copying lib/Crypto/Random/Fortuna/FortunaGenerator.py -> build/lib.linux-x86_64-2.7/Crypto/Random/Fortuna
creating build/lib.linux-x86_64-2.7/Crypto/Random/OSRNG
copying lib/Crypto/Random/OSRNG/rng_base.py -> build/lib.linux-x86_64-2.7/Crypto/Random/OSRNG
copying lib/Crypto/Random/OSRNG/init.py -> build/lib.linux-x86_64-2.7/Crypto/Random/OSRNG
copying lib/Crypto/Random/OSRNG/nt.py -> build/lib.linux-x86_64-2.7/Crypto/Random/OSRNG
copying lib/Crypto/Random/OSRNG/posix.py -> build/lib.linux-x86_64-2.7/Crypto/Random/OSRNG
copying lib/Crypto/Random/OSRNG/fallback.py -> build/lib.linux-x86_64-2.7/Crypto/Random/OSRNG
creating build/lib.linux-x86_64-2.7/Crypto/SelfTest
copying lib/Crypto/SelfTest/st_common.py -> build/lib.linux-x86_64-2.7/Crypto/SelfTest
copying lib/Crypto/SelfTest/init.py -> build/lib.linux-x86_64-2.7/Crypto/SelfTest
creating build/lib.linux-x86_64-2.7/Crypto/SelfTest/Cipher
copying lib/Crypto/SelfTest/Cipher/test_pkcs1_oaep.py -> build/lib.linux-x86_64-2.7/Crypto/SelfTest/Cipher
copying lib/Crypto/SelfTest/Cipher/common.py -> build/lib.linux-x86_64-2.7/Crypto/SelfTest/Cipher
copying lib/Crypto/SelfTest/Cipher/test_Blowfish.py -> build/lib.linux-x86_64-2.7/Crypto/SelfTest/Cipher
copying lib/Crypto/SelfTest/Cipher/init.py -> build/lib.linux-x86_64-2.7/Crypto/SelfTest/Cipher
copying lib/Crypto/SelfTest/Cipher/test_pkcs1_15.py -> build/lib.linux-x86_64-2.7/Crypto/SelfTest/Cipher
copying lib/Crypto/SelfTest/Cipher/test_XOR.py -> build/lib.linux-x86_64-2.7/Crypto/SelfTest/Cipher
copying lib/Crypto/SelfTest/Cipher/test_DES.py -> build/lib.linux-x86_64-2.7/Crypto/SelfTest/Cipher
copying lib/Crypto/SelfTest/Cipher/test_AES.py -> build/lib.linux-x86_64-2.7/Crypto/SelfTest/Cipher
copying lib/Crypto/SelfTest/Cipher/test_CAST.py -> build/lib.linux-x86_64-2.7/Crypto/SelfTest/Cipher
copying lib/Crypto/SelfTest/Cipher/test_ARC4.py -> build/lib.linux-x86_64-2.7/Crypto/SelfTest/Cipher
copying lib/Crypto/SelfTest/Cipher/test_ARC2.py -> build/lib.linux-x86_64-2.7/Crypto/SelfTest/Cipher
copying lib/Crypto/SelfTest/Cipher/test_DES3.py -> build/lib.linux-x86_64-2.7/Crypto/SelfTest/Cipher
creating build/lib.linux-x86_64-2.7/Crypto/SelfTest/Hash
copying lib/Crypto/SelfTest/Hash/test_HMAC.py -> build/lib.linux-x86_64-2.7/Crypto/SelfTest/Hash
copying lib/Crypto/SelfTest/Hash/common.py -> build/lib.linux-x86_64-2.7/Crypto/SelfTest/Hash
copying lib/Crypto/SelfTest/Hash/test_MD2.py -> build/lib.linux-x86_64-2.7/Crypto/SelfTest/Hash
copying lib/Crypto/SelfTest/Hash/test_SHA512.py -> build/lib.linux-x86_64-2.7/Crypto/SelfTest/Hash
copying lib/Crypto/SelfTest/Hash/test_SHA.py -> build/lib.linux-x86_64-2.7/Crypto/SelfTest/Hash
copying lib/Crypto/SelfTest/Hash/init.py -> build/lib.linux-x86_64-2.7/Crypto/SelfTest/Hash
copying lib/Crypto/SelfTest/Hash/test_MD4.py -> build/lib.linux-x86_64-2.7/Crypto/SelfTest/Hash
copying lib/Crypto/SelfTest/Hash/test_SHA256.py -> build/lib.linux-x86_64-2.7/Crypto/SelfTest/Hash
copying lib/Crypto/SelfTest/Hash/test_SHA224.py -> build/lib.linux-x86_64-2.7/Crypto/SelfTest/Hash
copying lib/Crypto/SelfTest/Hash/test_MD5.py -> build/lib.linux-x86_64-2.7/Crypto/SelfTest/Hash
copying lib/Crypto/SelfTest/Hash/test_SHA384.py -> build/lib.linux-x86_64-2.7/Crypto/SelfTest/Hash
copying lib/Crypto/SelfTest/Hash/test_RIPEMD.py -> build/lib.linux-x86_64-2.7/Crypto/SelfTest/Hash
creating build/lib.linux-x86_64-2.7/Crypto/SelfTest/Protocol
copying lib/Crypto/SelfTest/Protocol/test_AllOrNothing.py -> build/lib.linux-x86_64-2.7/Crypto/SelfTest/Protocol
copying lib/Crypto/SelfTest/Protocol/test_KDF.py -> build/lib.linux-x86_64-2.7/Crypto/SelfTest/Protocol
copying lib/Crypto/SelfTest/Protocol/init.py -> build/lib.linux-x86_64-2.7/Crypto/SelfTest/Protocol
copying lib/Crypto/SelfTest/Protocol/test_rfc1751.py -> build/lib.linux-x86_64-2.7/Crypto/SelfTest/Protocol
copying lib/Crypto/SelfTest/Protocol/test_chaffing.py -> build/lib.linux-x86_64-2.7/Crypto/SelfTest/Protocol
creating build/lib.linux-x86_64-2.7/Crypto/SelfTest/PublicKey
copying lib/Crypto/SelfTest/PublicKey/init.py -> build/lib.linux-x86_64-2.7/Crypto/SelfTest/PublicKey
copying lib/Crypto/SelfTest/PublicKey/test_importKey.py -> build/lib.linux-x86_64-2.7/Crypto/SelfTest/PublicKey
copying lib/Crypto/SelfTest/PublicKey/test_ElGamal.py -> build/lib.linux-x86_64-2.7/Crypto/SelfTest/PublicKey
copying lib/Crypto/SelfTest/PublicKey/test_DSA.py -> build/lib.linux-x86_64-2.7/Crypto/SelfTest/PublicKey
copying lib/Crypto/SelfTest/PublicKey/test_RSA.py -> build/lib.linux-x86_64-2.7/Crypto/SelfTest/PublicKey
creating build/lib.linux-x86_64-2.7/Crypto/SelfTest/Random
copying lib/Crypto/SelfTest/Random/test_rpoolcompat.py -> build/lib.linux-x86_64-2.7/Crypto/SelfTest/Random
copying lib/Crypto/SelfTest/Random/init.py -> build/lib.linux-x86_64-2.7/Crypto/SelfTest/Random
copying lib/Crypto/SelfTest/Random/test_random.py -> build/lib.linux-x86_64-2.7/Crypto/SelfTest/Random
copying lib/Crypto/SelfTest/Random/test__UserFriendlyRNG.py -> build/lib.linux-x86_64-2.7/Crypto/SelfTest/Random
creating build/lib.linux-x86_64-2.7/Crypto/SelfTest/Random/Fortuna
copying lib/Crypto/SelfTest/Random/Fortuna/test_FortunaGenerator.py -> build/lib.linux-x86_64-2.7/Crypto/SelfTest/Random/Fortuna
copying lib/Crypto/SelfTest/Random/Fortuna/init.py -> build/lib.linux-x86_64-2.7/Crypto/SelfTest/Random/Fortuna
copying lib/Crypto/SelfTest/Random/Fortuna/test_SHAd256.py -> build/lib.linux-x86_64-2.7/Crypto/SelfTest/Random/Fortuna
copying lib/Crypto/SelfTest/Random/Fortuna/test_FortunaAccumulator.py -> build/lib.linux-x86_64-2.7/Crypto/SelfTest/Random/Fortuna
creating build/lib.linux-x86_64-2.7/Crypto/SelfTest/Random/OSRNG
copying lib/Crypto/SelfTest/Random/OSRNG/init.py -> build/lib.linux-x86_64-2.7/Crypto/SelfTest/Random/OSRNG
copying lib/Crypto/SelfTest/Random/OSRNG/test_winrandom.py -> build/lib.linux-x86_64-2.7/Crypto/SelfTest/Random/OSRNG
copying lib/Crypto/SelfTest/Random/OSRNG/test_generic.py -> build/lib.linux-x86_64-2.7/Crypto/SelfTest/Random/OSRNG
copying lib/Crypto/SelfTest/Random/OSRNG/test_fallback.py -> build/lib.linux-x86_64-2.7/Crypto/SelfTest/Random/OSRNG
copying lib/Crypto/SelfTest/Random/OSRNG/test_posix.py -> build/lib.linux-x86_64-2.7/Crypto/SelfTest/Random/OSRNG
copying lib/Crypto/SelfTest/Random/OSRNG/test_nt.py -> build/lib.linux-x86_64-2.7/Crypto/SelfTest/Random/OSRNG
creating build/lib.linux-x86_64-2.7/Crypto/SelfTest/Util
copying lib/Crypto/SelfTest/Util/init.py -> build/lib.linux-x86_64-2.7/Crypto/SelfTest/Util
copying lib/Crypto/SelfTest/Util/test_winrandom.py -> build/lib.linux-x86_64-2.7/Crypto/SelfTest/Util
copying lib/Crypto/SelfTest/Util/test_asn1.py -> build/lib.linux-x86_64-2.7/Crypto/SelfTest/Util
copying lib/Crypto/SelfTest/Util/test_number.py -> build/lib.linux-x86_64-2.7/Crypto/SelfTest/Util
copying lib/Crypto/SelfTest/Util/test_Counter.py -> build/lib.linux-x86_64-2.7/Crypto/SelfTest/Util
creating build/lib.linux-x86_64-2.7/Crypto/SelfTest/Signature
copying lib/Crypto/SelfTest/Signature/test_pkcs1_pss.py -> build/lib.linux-x86_64-2.7/Crypto/SelfTest/Signature
copying lib/Crypto/SelfTest/Signature/init.py -> build/lib.linux-x86_64-2.7/Crypto/SelfTest/Signature
copying lib/Crypto/SelfTest/Signature/test_pkcs1_15.py -> build/lib.linux-x86_64-2.7/Crypto/SelfTest/Signature
creating build/lib.linux-x86_64-2.7/Crypto/Protocol
copying lib/Crypto/Protocol/init.py -> build/lib.linux-x86_64-2.7/Crypto/Protocol
copying lib/Crypto/Protocol/KDF.py -> build/lib.linux-x86_64-2.7/Crypto/Protocol
copying lib/Crypto/Protocol/Chaffing.py -> build/lib.linux-x86_64-2.7/Crypto/Protocol
copying lib/Crypto/Protocol/AllOrNothing.py -> build/lib.linux-x86_64-2.7/Crypto/Protocol
creating build/lib.linux-x86_64-2.7/Crypto/PublicKey
copying lib/Crypto/PublicKey/_RSA.py -> build/lib.linux-x86_64-2.7/Crypto/PublicKey
copying lib/Crypto/PublicKey/init.py -> build/lib.linux-x86_64-2.7/Crypto/PublicKey
copying lib/Crypto/PublicKey/_slowmath.py -> build/lib.linux-x86_64-2.7/Crypto/PublicKey
copying lib/Crypto/PublicKey/RSA.py -> build/lib.linux-x86_64-2.7/Crypto/PublicKey
copying lib/Crypto/PublicKey/pubkey.py -> build/lib.linux-x86_64-2.7/Crypto/PublicKey
copying lib/Crypto/PublicKey/_DSA.py -> build/lib.linux-x86_64-2.7/Crypto/PublicKey
copying lib/Crypto/PublicKey/DSA.py -> build/lib.linux-x86_64-2.7/Crypto/PublicKey
copying lib/Crypto/PublicKey/ElGamal.py -> build/lib.linux-x86_64-2.7/Crypto/PublicKey
creating build/lib.linux-x86_64-2.7/Crypto/Signature
copying lib/Crypto/Signature/init.py -> build/lib.linux-x86_64-2.7/Crypto/Signature
copying lib/Crypto/Signature/PKCS1_v1_5.py -> build/lib.linux-x86_64-2.7/Crypto/Signature
copying lib/Crypto/Signature/PKCS1_PSS.py -> build/lib.linux-x86_64-2.7/Crypto/Signature
running build_ext
running build_configure
building 'Crypto.PublicKey._fastmath' extension
creating build/temp.linux-x86_64-2.7
creating build/temp.linux-x86_64-2.7/src
x86_64-linux-gnu-gcc -pthread -fwrapv -Wall -Wstrict-prototypes -fno-strict-aliasing -Wdate-time -D_FORTIFY_SOURCE=2 -fstack-protector-strong -Wformat -Werror=format-security -fPIC -std=c99 -O3 -fomit-frame-pointer -Isrc/ -I/usr/include/ -I/usr/include/python2.7 -c src/_fastmath.c -o build/temp.linux-x86_64-2.7/src/_fastmath.o
src/_fastmath.c:31:20: fatal error: Python.h: No such file or directory
compilation terminated.
error: command 'x86_64-linux-gnu-gcc' failed with exit status 1
----------------------------------------
Command "/home/pruthvi/pgAdmin4/pgAdmin4/bin/python2 -u -c "import setuptools, tokenize;file='/tmp/pip-install-pnCtdC/pycrypto/setup.py';f=getattr(tokenize, 'open', open)(file);code=f.read().replace('\r\n', '\n');f.close();exec(compile(code, file, 'exec'))" install --record /tmp/pip-record-vQSO23/install-record.txt --single-version-externally-managed --compile --install-headers /home/pruthvi/pgAdmin4/pgAdmin4/include/site/python2.7/pycrypto" failed with error code 1 in /tmp/pip-install-pnCtdC/pycrypto/
Hi Prototype-X I get the above error hen trying to install pgAdmin 4 in my Ubuntu.
Cn you please look into it.?
testtools 2.3.0 has requirement extras>=1.0.0, but you'll have extras 0.0.3 which is incompatible.
nice, thanks.
Exception:
Traceback (most recent call last):
File "/usr/lib/python3/dist-packages/pip/basecommand.py", line 215, in main
status = self.run(options, args)
File "/usr/lib/python3/dist-packages/pip/commands/install.py", line 342, in run
requirement_set.prepare_files(finder)
File "/usr/lib/python3/dist-packages/pip/req/req_set.py", line 380, in prepare_files
ignore_dependencies=self.ignore_dependencies))
File "/usr/lib/python3/dist-packages/pip/req/req_set.py", line 620, in _prepare_file
session=self.session, hashes=hashes)
File "/usr/lib/python3/dist-packages/pip/download.py", line 809, in unpack_url
unpack_file_url(link, location, download_dir, hashes=hashes)
File "/usr/lib/python3/dist-packages/pip/download.py", line 715, in unpack_file_url
unpack_file(from_path, location, content_type, link)
File "/usr/lib/python3/dist-packages/pip/utils/init.py", line 617, in unpack_file
flatten=not filename.endswith('.whl')
File "/usr/lib/python3/dist-packages/pip/utils/init.py", line 500, in unzip_file
zipfp = open(filename, 'rb')
FileNotFoundError: [Errno 2] No such file or directory: '/home/moringa/pgAdmin4/pgadmin4-2.0-py2.py3-none-any.whl'
I Get the above error , kindly help
having set this:
services:
pgadmin:
image: dpage/pgadmin4:latest
volumes:
- /data/pgadmin:/var/lib/pgadmin
… I had to do chown -R 5050:5050 /data/pgadmin
on the host system when upgrade to v4.16 came in.
5050 is the uid of pgadmin
in my container, so it might help to do docker exec -ti <pgadmin_container> id pgadmin
first.
me da el error de status 1 en el paso 6.. alguen me puede ayudar por favor?
wget https://ftp.postgresql.org/pub/pgadmin/pgadmin4/v1.5/source/pgadmin4-1.5.tar.gz