Skip to content

Instantly share code, notes, and snippets.

Show Gist options
  • Save ShapeShifter499/d73f86646af5d3fb841ff41ba28ceba6 to your computer and use it in GitHub Desktop.
Save ShapeShifter499/d73f86646af5d3fb841ff41ba28ceba6 to your computer and use it in GitHub Desktop.
Build error log
CC drivers/staging/prima/CORE/MAC/src/pe/lim/limIbssPeerMgmt.o
CC drivers/staging/prima/CORE/MAC/src/pe/lim/limLinkMonitoringAlgo.o
CC drivers/staging/prima/CORE/MAC/src/pe/lim/limLogDump.o
CC drivers/staging/prima/CORE/MAC/src/pe/lim/limP2P.o
CC drivers/staging/prima/CORE/MAC/src/pe/lim/limProcessActionFrame.o
CC drivers/staging/prima/CORE/MAC/src/pe/lim/limProcessAssocReqFrame.o
CC drivers/usb/mon/mon_main.o
CC drivers/staging/prima/CORE/MAC/src/pe/lim/limProcessAssocRspFrame.o
CC drivers/usb/mon/mon_stat.o
CC drivers/usb/mon/mon_text.o
CC drivers/staging/prima/CORE/MAC/src/pe/lim/limProcessAuthFrame.o
CC drivers/usb/mon/mon_bin.o
LD drivers/usb/mon/usbmon.o
CC drivers/staging/prima/CORE/MAC/src/pe/lim/limProcessBeaconFrame.o
LD drivers/usb/mon/built-in.o
CC drivers/usb/otg/otg.o
CC drivers/usb/otg/msm_otg.o
CC drivers/staging/prima/CORE/MAC/src/pe/lim/limProcessCfgUpdates.o
CC drivers/staging/prima/CORE/MAC/src/pe/lim/limProcessDeauthFrame.o
../../../../../../kernel/lge/msm8226/drivers/usb/otg/msm_otg.c: In function 'msm_otg_sm_work':
../../../../../../kernel/lge/msm8226/drivers/usb/otg/msm_otg.c:3771:6: error: implicit declaration of function 'lge_chg_detect_work' [-Werror=implicit-function-declaration]
lge_chg_detect_work(&motg->lge_chg_work.work);
^
../../../../../../kernel/lge/msm8226/drivers/usb/otg/msm_otg.c:3771:31: error: 'struct msm_otg' has no member named 'lge_chg_work'
lge_chg_detect_work(&motg->lge_chg_work.work);
^
../../../../../../kernel/lge/msm8226/drivers/usb/otg/msm_otg.c:3804:35: error: 'struct msm_otg' has no member named 'lge_chg_work'
cancel_delayed_work_sync(&motg->lge_chg_work);
^
../../../../../../kernel/lge/msm8226/drivers/usb/otg/msm_otg.c:3877:31: error: 'struct msm_otg' has no member named 'lge_chg_work'
lge_chg_detect_work(&motg->lge_chg_work.work);
^
cc1: some warnings being treated as errors
/home/raansu-ubuntu/LG_Volt_CM13/kernel/lge/msm8226/scripts/Makefile.build:307: recipe for target 'drivers/usb/otg/msm_otg.o' failed
make[5]: *** [drivers/usb/otg/msm_otg.o] Error 1
/home/raansu-ubuntu/LG_Volt_CM13/kernel/lge/msm8226/scripts/Makefile.build:443: recipe for target 'drivers/usb/otg' failed
make[4]: *** [drivers/usb/otg] Error 2
make[4]: *** Waiting for unfinished jobs....
CC drivers/staging/prima/CORE/MAC/src/pe/lim/limProcessDisassocFrame.o
CC drivers/staging/prima/CORE/MAC/src/pe/lim/limProcessLmmMessages.o
CC drivers/staging/prima/CORE/MAC/src/pe/lim/limProcessMessageQueue.o
CC drivers/staging/prima/CORE/MAC/src/pe/lim/limProcessMlmReqMessages.o
CC drivers/staging/prima/CORE/MAC/src/pe/lim/limProcessMlmRspMessages.o
CC drivers/staging/prima/CORE/MAC/src/pe/lim/limProcessProbeReqFrame.o
LD drivers/usb/host/built-in.o
CC drivers/staging/zram/zram_drv.o
CC drivers/staging/prima/CORE/MAC/src/pe/lim/limProcessProbeRspFrame.o
LD drivers/staging/zram/zram.o
LD drivers/staging/zram/built-in.o
CC drivers/staging/prima/CORE/MAC/src/pe/lim/limProcessSmeReqMessages.o
CC drivers/staging/zsmalloc/zsmalloc-main.o
CC drivers/staging/prima/CORE/MAC/src/pe/lim/limPropExtsUtils.o
LD drivers/staging/zsmalloc/zsmalloc.o
LD drivers/staging/zsmalloc/built-in.o
CC drivers/staging/prima/CORE/MAC/src/pe/lim/limRoamingAlgo.o
CC drivers/staging/prima/CORE/MAC/src/pe/lim/limScanResultUtils.o
CC drivers/staging/prima/CORE/MAC/src/pe/lim/limSecurityUtils.o
CC drivers/staging/prima/CORE/MAC/src/pe/lim/limSendManagementFrames.o
CC drivers/staging/prima/CORE/MAC/src/pe/lim/limSendMessages.o
CC drivers/staging/prima/CORE/MAC/src/pe/lim/limSendSmeRspMessages.o
CC drivers/staging/prima/CORE/MAC/src/pe/lim/limSerDesUtils.o
CC drivers/staging/prima/CORE/MAC/src/pe/lim/limSession.o
CC drivers/staging/prima/CORE/MAC/src/pe/lim/limSessionUtils.o
CC drivers/staging/prima/CORE/MAC/src/pe/lim/limSmeReqUtils.o
CC drivers/staging/prima/CORE/MAC/src/pe/lim/limStaHashApi.o
CC drivers/staging/prima/CORE/MAC/src/pe/lim/limTimerUtils.o
CC drivers/staging/prima/CORE/MAC/src/pe/lim/limTrace.o
CC drivers/staging/prima/CORE/MAC/src/pe/lim/limUtils.o
CC drivers/staging/prima/CORE/MAC/src/pe/pmm/pmmAP.o
CC drivers/staging/prima/CORE/MAC/src/pe/pmm/pmmApi.o
CC drivers/staging/prima/CORE/MAC/src/pe/pmm/pmmDebug.o
CC drivers/staging/prima/CORE/MAC/src/pe/sch/schApi.o
CC drivers/staging/prima/CORE/MAC/src/pe/sch/schBeaconGen.o
CC drivers/staging/prima/CORE/MAC/src/pe/sch/schBeaconProcess.o
CC drivers/staging/prima/CORE/MAC/src/pe/sch/schDebug.o
CC drivers/staging/prima/CORE/MAC/src/pe/sch/schMessage.o
CC drivers/staging/prima/CORE/MAC/src/pe/rrm/rrmApi.o
CC drivers/staging/prima/CORE/SAP/src/sapApiLinkCntl.o
CC drivers/staging/prima/CORE/SAP/src/sapChSelect.o
CC drivers/staging/prima/CORE/SAP/src/sapFsm.o
CC drivers/staging/prima/CORE/SAP/src/sapModule.o
CC drivers/staging/prima/CORE/SME/src/btc/btcApi.o
CC drivers/staging/prima/CORE/SME/src/ccm/ccmApi.o
CC drivers/staging/prima/CORE/SME/src/ccm/ccmLogDump.o
CC drivers/staging/prima/CORE/SME/src/sme_common/sme_Api.o
CC drivers/staging/prima/CORE/SME/src/sme_common/sme_FTApi.o
CC drivers/staging/prima/CORE/SME/src/sme_common/sme_Trace.o
CC drivers/staging/prima/CORE/SME/src/csr/csrApiRoam.o
CC drivers/staging/prima/CORE/SME/src/csr/csrApiScan.o
CC drivers/staging/prima/CORE/SME/src/csr/csrCmdProcess.o
CC drivers/staging/prima/CORE/SME/src/csr/csrLinkList.o
CC drivers/staging/prima/CORE/SME/src/csr/csrLogDump.o
CC drivers/staging/prima/CORE/SME/src/csr/csrNeighborRoam.o
CC drivers/staging/prima/CORE/SME/src/csr/csrUtil.o
CC drivers/staging/prima/CORE/SME/src/oemData/oemDataApi.o
CC drivers/staging/prima/CORE/SME/src/p2p/p2p_Api.o
CC drivers/staging/prima/CORE/SME/src/pmc/pmcApi.o
CC drivers/staging/prima/CORE/SME/src/pmc/pmc.o
CC drivers/staging/prima/CORE/SME/src/pmc/pmcLogDump.o
CC drivers/staging/prima/CORE/SME/src/QoS/sme_Qos.o
CC drivers/staging/prima/CORE/SME/src/rrm/sme_rrm.o
CC drivers/staging/prima/CORE/SVC/src/btc/wlan_btc_svc.o
CC drivers/staging/prima/CORE/SVC/src/nlink/wlan_nlink_srv.o
CC drivers/staging/prima/CORE/SVC/src/ptt/wlan_ptt_sock_svc.o
CC drivers/staging/prima/CORE/SYS/common/src/wlan_qct_sys.o
CC drivers/staging/prima/CORE/SYS/legacy/src/pal/src/palApiComm.o
CC drivers/staging/prima/CORE/SYS/legacy/src/pal/src/palTimer.o
CC drivers/staging/prima/CORE/SYS/legacy/src/platform/src/VossWrapper.o
CC drivers/staging/prima/CORE/SYS/legacy/src/system/src/macInitApi.o
CC drivers/staging/prima/CORE/SYS/legacy/src/system/src/sysEntryFunc.o
CC drivers/staging/prima/CORE/SYS/legacy/src/utils/src/dot11f.o
CC drivers/staging/prima/CORE/SYS/legacy/src/utils/src/logApi.o
CC drivers/staging/prima/CORE/SYS/legacy/src/utils/src/logDump.o
CC drivers/staging/prima/CORE/SYS/legacy/src/utils/src/macTrace.o
CC drivers/staging/prima/CORE/SYS/legacy/src/utils/src/parserApi.o
CC drivers/staging/prima/CORE/SYS/legacy/src/utils/src/utilsApi.o
CC drivers/staging/prima/CORE/SYS/legacy/src/utils/src/utilsParser.o
CC drivers/staging/prima/CORE/TL/src/wlan_qct_tl.o
CC drivers/staging/prima/CORE/TL/src/wlan_qct_tl_ba.o
CC drivers/staging/prima/CORE/TL/src/wlan_qct_tl_hosupport.o
CC drivers/staging/prima/CORE/VOSS/src/vos_api.o
CC drivers/staging/prima/CORE/VOSS/src/vos_event.o
CC drivers/staging/prima/CORE/VOSS/src/vos_getBin.o
CC drivers/staging/prima/CORE/VOSS/src/vos_list.o
CC drivers/staging/prima/CORE/VOSS/src/vos_lock.o
CC drivers/staging/prima/CORE/VOSS/src/vos_memory.o
CC drivers/staging/prima/CORE/VOSS/src/vos_mq.o
CC drivers/staging/prima/CORE/VOSS/src/vos_nvitem.o
CC drivers/staging/prima/CORE/VOSS/src/vos_packet.o
CC drivers/staging/prima/CORE/VOSS/src/vos_power.o
CC drivers/staging/prima/CORE/VOSS/src/vos_sched.o
CC drivers/staging/prima/CORE/VOSS/src/vos_threads.o
CC drivers/staging/prima/CORE/VOSS/src/vos_timer.o
CC drivers/staging/prima/CORE/VOSS/src/vos_trace.o
CC drivers/staging/prima/CORE/VOSS/src/vos_types.o
CC drivers/staging/prima/CORE/VOSS/src/vos_utils.o
CC drivers/staging/prima/CORE/VOSS/src/wlan_nv_parser.o
CC drivers/staging/prima/CORE/VOSS/src/wlan_nv_stream_read.o
CC drivers/staging/prima/CORE/VOSS/src/wlan_nv_template_builtin.o
CC drivers/staging/prima/CORE/VOSS/src/vos_diag.o
CC drivers/staging/prima/CORE/WDA/src/wlan_qct_wda.o
LD drivers/usb/gadget/g_android.o
LD drivers/usb/gadget/built-in.o
/home/raansu-ubuntu/LG_Volt_CM13/kernel/lge/msm8226/scripts/Makefile.build:443: recipe for target 'drivers/usb' failed
make[3]: *** [drivers/usb] Error 2
make[3]: *** Waiting for unfinished jobs....
CC drivers/staging/prima/CORE/WDA/src/wlan_qct_wda_debug.o
CC drivers/staging/prima/CORE/WDA/src/wlan_qct_wda_ds.o
CC drivers/staging/prima/CORE/WDA/src/wlan_qct_wda_legacy.o
CC drivers/staging/prima/CORE/WDA/src/wlan_nv.o
CC drivers/staging/prima/CORE/WDI/CP/src/wlan_qct_wdi.o
CC drivers/staging/prima/CORE/WDI/CP/src/wlan_qct_wdi_dp.o
CC drivers/staging/prima/CORE/WDI/CP/src/wlan_qct_wdi_sta.o
CC drivers/staging/prima/CORE/WDI/DP/src/wlan_qct_wdi_bd.o
CC drivers/staging/prima/CORE/WDI/DP/src/wlan_qct_wdi_ds.o
CC drivers/staging/prima/CORE/WDI/TRP/CTS/src/wlan_qct_wdi_cts.o
CC drivers/staging/prima/CORE/WDI/TRP/DTS/src/wlan_qct_wdi_dts.o
CC drivers/staging/prima/CORE/WDI/WPAL/src/wlan_qct_pal_api.o
CC drivers/staging/prima/CORE/WDI/WPAL/src/wlan_qct_pal_msg.o
CC drivers/staging/prima/CORE/WDI/WPAL/src/wlan_qct_pal_device.o
CC drivers/staging/prima/CORE/WDI/WPAL/src/wlan_qct_pal_packet.o
CC drivers/staging/prima/CORE/WDI/WPAL/src/wlan_qct_pal_sync.o
CC drivers/staging/prima/CORE/WDI/WPAL/src/wlan_qct_pal_timer.o
CC drivers/staging/prima/CORE/WDI/WPAL/src/wlan_qct_pal_trace.o
LD drivers/staging/prima/wlan.o
LD drivers/staging/prima/built-in.o
LD drivers/staging/built-in.o
/home/raansu-ubuntu/LG_Volt_CM13/kernel/lge/msm8226/Makefile:950: recipe for target 'drivers' failed
make[2]: *** [drivers] Error 2
Makefile:130: recipe for target 'sub-make' failed
make[1]: *** [sub-make] Error 2
make[1]: Leaving directory '/home/raansu-ubuntu/LG_Volt_CM13/kernel/lge/msm8226'
build/core/tasks/kernel.mk:286: recipe for target 'TARGET_KERNEL_BINARIES' failed
make: *** [TARGET_KERNEL_BINARIES] Error 2
make: Leaving directory '/home/raansu-ubuntu/LG_Volt_CM13'
#### make failed to build some targets (03:14 (mm:ss)) ####
raansu-ubuntu@ubuntu-16:~/LG_Volt_CM13$
Sign up for free to join this conversation on GitHub. Already have an account? Sign in to comment