Created
April 11, 2012 22:53
-
-
Save catamorphism/2363315 to your computer and use it in GitHub Desktop.
VERBOSE build log
This file contains hidden or bidirectional Unicode text that may be interpreted or compiled differently than what appears below. To review, open the file in an editor that reveals hidden Unicode characters.
Learn more about bidirectional Unicode characters
| cfg: shell host triple x86_64-apple-darwin | |
| cfg: host for x86_64-apple-darwin is x86_64 | |
| cfg: unix-y environment | |
| cfg: using gcc | |
| cfg: no pandoc found, omitting doc/rust.pdf | |
| cfg: no llnextgen found, omitting grammar-verification | |
| cfg: no pandoc found, omitting library doc build | |
| cfg: including dist rules | |
| cfg: including test rules | |
| find x86_64-apple-darwin/test \ | |
| -name '*.[odasS]' -o \ | |
| -name '*.so' -o \ | |
| -name '*.dylib' -o \ | |
| -name '*.dll' -o \ | |
| -name '*.def' -o \ | |
| -name '*.bc' -o \ | |
| -name '*.dSYM' -o \ | |
| -name '*.libaux' -o \ | |
| -name '*.out' -o \ | |
| -name '*.err' \ | |
| | xargs rm -rf | |
| rm -f tmp/*.log | |
| echo \ | |
| ../src/etc/check-summary.py ../src/etc/combine-tests.py ../src/etc/extract-tests.py ../src/etc/extract_grammar.py ../src/etc/get-snapshot.py ../src/etc/latest-unix-snaps.py ../src/etc/make-snapshot.py ../src/etc/mirror-all-snapshots.py ../src/etc/snapshot.py ../src/etc/tidy.py ../src/etc/unicode.py \ | |
| ../src/rustc/rustc.rc \ | |
| ../src/rustc/rustc.rc ../src/rustc/driver.rs ../src/rustc/syntax.rs ../src/rustc/back/abi.rs ../src/rustc/back/link.rs ../src/rustc/back/rpath.rs ../src/rustc/back/target_strs.rs ../src/rustc/back/upcall.rs ../src/rustc/back/x86.rs ../src/rustc/back/x86_64.rs ../src/rustc/driver/driver.rs ../src/rustc/driver/session.rs ../src/rustc/front/config.rs ../src/rustc/front/core_inject.rs ../src/rustc/front/test.rs ../src/rustc/lib/llvm.rs ../src/rustc/metadata/astencode.rs ../src/rustc/metadata/common.rs ../src/rustc/metadata/creader.rs ../src/rustc/metadata/csearch.rs ../src/rustc/metadata/cstore.rs ../src/rustc/metadata/decoder.rs ../src/rustc/metadata/encoder.rs ../src/rustc/metadata/tydecode.rs ../src/rustc/metadata/tyencode.rs ../src/rustc/middle/alias.rs ../src/rustc/middle/ast_map.rs ../src/rustc/middle/block_use.rs ../src/rustc/middle/capture.rs ../src/rustc/middle/check_alt.rs ../src/rustc/middle/check_const.rs ../src/rustc/middle/check_loop.rs ../src/rustc/middle/const_eval.rs ../src/rustc/middle/fn_usage.rs ../src/rustc/middle/freevars.rs ../src/rustc/middle/infer.rs ../src/rustc/middle/kind.rs ../src/rustc/middle/last_use.rs ../src/rustc/middle/lint.rs ../src/rustc/middle/mutbl.rs ../src/rustc/middle/pairwise.rs ../src/rustc/middle/pat_util.rs ../src/rustc/middle/region.rs ../src/rustc/middle/regionck.rs ../src/rustc/middle/resolve.rs ../src/rustc/middle/ty.rs ../src/rustc/middle/typeck.rs ../src/rustc/util/common.rs ../src/rustc/util/filesearch.rs ../src/rustc/util/ppaux.rs ../src/rustc/middle/trans/alt.rs ../src/rustc/middle/trans/base.rs ../src/rustc/middle/trans/build.rs ../src/rustc/middle/trans/closure.rs ../src/rustc/middle/trans/common.rs ../src/rustc/middle/trans/debuginfo.rs ../src/rustc/middle/trans/impl.rs ../src/rustc/middle/trans/native.rs ../src/rustc/middle/trans/reachable.rs ../src/rustc/middle/trans/shape.rs ../src/rustc/middle/trans/tvec.rs ../src/rustc/middle/trans/type_of.rs ../src/rustc/middle/trans/type_use.rs ../src/rustc/middle/trans/uniq.rs ../src/rustc/middle/tstate/ann.rs ../src/rustc/middle/tstate/annotate.rs ../src/rustc/middle/tstate/auxiliary.rs ../src/rustc/middle/tstate/bitvectors.rs ../src/rustc/middle/tstate/ck.rs ../src/rustc/middle/tstate/collect_locals.rs ../src/rustc/middle/tstate/pre_post_conditions.rs ../src/rustc/middle/tstate/states.rs ../src/rustc/middle/tstate/tritv.rs \ | |
| ../src/librustsyntax/rustsyntax.rc \ | |
| ../src/librustsyntax/rustsyntax.rc ../src/librustsyntax/ast.rs ../src/librustsyntax/ast_util.rs ../src/librustsyntax/attr.rs ../src/librustsyntax/codemap.rs ../src/librustsyntax/diagnostic.rs ../src/librustsyntax/fold.rs ../src/librustsyntax/visit.rs ../src/librustsyntax/ext/auto_serialize.rs ../src/librustsyntax/ext/base.rs ../src/librustsyntax/ext/build.rs ../src/librustsyntax/ext/concat_idents.rs ../src/librustsyntax/ext/env.rs ../src/librustsyntax/ext/expand.rs ../src/librustsyntax/ext/fmt.rs ../src/librustsyntax/ext/ident_to_str.rs ../src/librustsyntax/ext/log_syntax.rs ../src/librustsyntax/ext/qquote.rs ../src/librustsyntax/ext/simplext.rs ../src/librustsyntax/parse/eval.rs ../src/librustsyntax/parse/lexer.rs ../src/librustsyntax/parse/parser.rs ../src/librustsyntax/parse/token.rs ../src/librustsyntax/print/pp.rs ../src/librustsyntax/print/pprust.rs ../src/librustsyntax/util/interner.rs \ | |
| ../src/libcore/core.rc \ | |
| ../src/libcore/core.rc ../src/libcore/bool.rs ../src/libcore/box.rs ../src/libcore/char.rs ../src/libcore/cmath.rs ../src/libcore/comm.rs ../src/libcore/core.rs ../src/libcore/either.rs ../src/libcore/extfmt.rs ../src/libcore/f32.rs ../src/libcore/f64.rs ../src/libcore/float.rs ../src/libcore/future.rs ../src/libcore/i16.rs ../src/libcore/i32.rs ../src/libcore/i64.rs ../src/libcore/i8.rs ../src/libcore/int.rs ../src/libcore/io.rs ../src/libcore/iter.rs ../src/libcore/libc.rs ../src/libcore/logging.rs ../src/libcore/option.rs ../src/libcore/os.rs ../src/libcore/path.rs ../src/libcore/priv.rs ../src/libcore/ptr.rs ../src/libcore/rand.rs ../src/libcore/result.rs ../src/libcore/run.rs ../src/libcore/str.rs ../src/libcore/sys.rs ../src/libcore/task.rs ../src/libcore/to_str.rs ../src/libcore/tuple.rs ../src/libcore/u16.rs ../src/libcore/u32.rs ../src/libcore/u64.rs ../src/libcore/u8.rs ../src/libcore/uint.rs ../src/libcore/unicode.rs ../src/libcore/unsafe.rs ../src/libcore/vec.rs \ | |
| ../src/libstd/std.rc \ | |
| ../src/libstd/std.rc ../src/libstd/arena.rs ../src/libstd/bitv.rs ../src/libstd/c_vec.rs ../src/libstd/dbg.rs ../src/libstd/deque.rs ../src/libstd/ebml.rs ../src/libstd/four.rs ../src/libstd/fun_treemap.rs ../src/libstd/getopts.rs ../src/libstd/json.rs ../src/libstd/list.rs ../src/libstd/map.rs ../src/libstd/md4.rs ../src/libstd/net.rs ../src/libstd/prettyprint.rs ../src/libstd/rope.rs ../src/libstd/serialization.rs ../src/libstd/sha1.rs ../src/libstd/smallintmap.rs ../src/libstd/sort.rs ../src/libstd/tempfile.rs ../src/libstd/term.rs ../src/libstd/test.rs ../src/libstd/time.rs ../src/libstd/treemap.rs ../src/libstd/tri.rs ../src/libstd/ufind.rs ../src/libstd/unicode.rs ../src/libstd/util.rs ../src/libstd/uv.rs ../src/libstd/uv_hl.rs ../src/libstd/uv_ll.rs \ | |
| ../src/compiletest/compiletest.rc \ | |
| ../src/compiletest/common.rs ../src/compiletest/compiletest.rs ../src/compiletest/errors.rs ../src/compiletest/header.rs ../src/compiletest/procsrv.rs ../src/compiletest/runtest.rs ../src/compiletest/util.rs \ | |
| ../src/cargo/cargo.rc \ | |
| ../src/cargo/cargo.rs ../src/cargo/pgp.rs \ | |
| ../src/rustdoc/rustdoc.rc \ | |
| ../src/rustdoc/astsrv.rs ../src/rustdoc/attr_parser.rs ../src/rustdoc/attr_pass.rs ../src/rustdoc/config.rs ../src/rustdoc/demo.rs ../src/rustdoc/desc_to_brief_pass.rs ../src/rustdoc/doc.rs ../src/rustdoc/escape_pass.rs ../src/rustdoc/extract.rs ../src/rustdoc/fold.rs ../src/rustdoc/markdown_index_pass.rs ../src/rustdoc/markdown_pass.rs ../src/rustdoc/markdown_writer.rs ../src/rustdoc/page_pass.rs ../src/rustdoc/par.rs ../src/rustdoc/parse.rs ../src/rustdoc/path_pass.rs ../src/rustdoc/prune_hidden_pass.rs ../src/rustdoc/prune_unexported_pass.rs ../src/rustdoc/reexport_pass.rs ../src/rustdoc/rustdoc.rs ../src/rustdoc/sectionalize_pass.rs ../src/rustdoc/sort_item_name_pass.rs ../src/rustdoc/sort_item_type_pass.rs ../src/rustdoc/sort_pass.rs ../src/rustdoc/text_pass.rs ../src/rustdoc/trim_pass.rs ../src/rustdoc/tystr_pass.rs ../src/rustdoc/unindent_pass.rs \ | |
| | xargs -n 10 python ../src/etc/tidy.py | |
| echo \ | |
| ../src/test/auxiliary/cci_class.rs ../src/test/auxiliary/cci_class_2.rs ../src/test/auxiliary/cci_class_3.rs ../src/test/auxiliary/cci_class_4.rs ../src/test/auxiliary/cci_class_5.rs ../src/test/auxiliary/cci_class_6.rs ../src/test/auxiliary/cci_impl_lib.rs ../src/test/auxiliary/cci_iter_lib.rs ../src/test/auxiliary/cci_nested_lib.rs ../src/test/auxiliary/cci_no_inline_lib.rs ../src/test/auxiliary/crateresolve1-1.rs ../src/test/auxiliary/crateresolve1-2.rs ../src/test/auxiliary/crateresolve1-3.rs ../src/test/auxiliary/crateresolve2-1.rs ../src/test/auxiliary/crateresolve2-2.rs ../src/test/auxiliary/crateresolve2-3.rs ../src/test/auxiliary/crateresolve3-1.rs ../src/test/auxiliary/crateresolve3-2.rs ../src/test/auxiliary/crateresolve4a-1.rs ../src/test/auxiliary/crateresolve4a-2.rs ../src/test/auxiliary/crateresolve4b-1.rs ../src/test/auxiliary/crateresolve4b-2.rs ../src/test/auxiliary/crateresolve5-1.rs ../src/test/auxiliary/crateresolve5-2.rs ../src/test/auxiliary/crateresolve7x.rs ../src/test/auxiliary/crateresolve_calories-1.rs ../src/test/auxiliary/crateresolve_calories-2.rs ../src/test/auxiliary/issue2170lib.rs ../src/test/auxiliary/native_lib.rs ../src/test/auxiliary/noexporttypelib.rs ../src/test/bench/99bob-iter.rs ../src/test/bench/99bob-pattern.rs ../src/test/bench/99bob-simple.rs ../src/test/bench/99bob-tail.rs ../src/test/bench/msgsend.rs ../src/test/bench/shootout-ackermann.rs ../src/test/bench/shootout-binarytrees.rs ../src/test/bench/shootout-fannkuchredux.rs ../src/test/bench/shootout-fasta.rs ../src/test/bench/shootout-fibo.rs ../src/test/bench/shootout-mandelbrot.rs ../src/test/bench/shootout-nbody.rs ../src/test/bench/shootout-pfib.rs ../src/test/bench/shootout-spectralnorm.rs ../src/test/bench/shootout-threadring.rs ../src/test/bench/sudoku.rs ../src/test/bench/task-perf-one-million.rs ../src/test/bench/task-perf-spawnalot.rs ../src/test/bench/task-perf-vector-party.rs ../src/test/bench/task-perf-word-count-generic.rs ../src/test/bench/task-perf-word-count.rs ../src/test/compile-fail/alt-join.rs ../src/test/compile-fail/alt-range-fail-dominate.rs ../src/test/compile-fail/alt-range-fail.rs ../src/test/compile-fail/alt-tag-nullary.rs ../src/test/compile-fail/alt-tag-unary.rs ../src/test/compile-fail/and-init.rs ../src/test/compile-fail/arg-count-mismatch.rs ../src/test/compile-fail/arg-style-mismatch.rs ../src/test/compile-fail/arg-type-mismatch.rs ../src/test/compile-fail/assign-super.rs ../src/test/compile-fail/assign-to-method.rs ../src/test/compile-fail/attempted-access-non-fatal.rs ../src/test/compile-fail/attr-bad-meta.rs ../src/test/compile-fail/attr-before-ext.rs ../src/test/compile-fail/attr-before-let.rs ../src/test/compile-fail/attr-before-stmt.rs ../src/test/compile-fail/attr-before-view-item.rs ../src/test/compile-fail/attr-before-view-item2.rs ../src/test/compile-fail/attr-dangling-in-fn.rs ../src/test/compile-fail/attr-dangling-in-mod.rs ../src/test/compile-fail/auto-deref-bind.rs ../src/test/compile-fail/autoderef-full-lval.rs ../src/test/compile-fail/bad-alt.rs ../src/test/compile-fail/bad-bang-ann-2.rs ../src/test/compile-fail/bad-bang-ann-3.rs ../src/test/compile-fail/bad-bang-ann.rs ../src/test/compile-fail/bad-const-type.rs ../src/test/compile-fail/bad-env-capture.rs ../src/test/compile-fail/bad-env-capture2.rs ../src/test/compile-fail/bad-env-capture3.rs ../src/test/compile-fail/bad-expr-path.rs ../src/test/compile-fail/bad-expr-path2.rs ../src/test/compile-fail/bad-main.rs ../src/test/compile-fail/bad-method-typaram-kind.rs ../src/test/compile-fail/bad-module.rs ../src/test/compile-fail/bad-name.rs ../src/test/compile-fail/bad-record-pat-2.rs ../src/test/compile-fail/bad-record-pat.rs ../src/test/compile-fail/bad-tag-export-2.rs ../src/test/compile-fail/bad-tag-export-3.rs ../src/test/compile-fail/bad-tag-export-4.rs ../src/test/compile-fail/bad-tag-export.rs ../src/test/compile-fail/bad-type-env-capture.rs ../src/test/compile-fail/bad-var-env-capture-in-block-arg.rs ../src/test/compile-fail/bang-tailexpr.rs ../src/test/compile-fail/bind-stack-closure.rs ../src/test/compile-fail/binop-add-ptr.rs ../src/test/compile-fail/binop-add-tup-assign.rs ../src/test/compile-fail/binop-add-tup.rs ../src/test/compile-fail/binop-bitxor-str.rs ../src/test/compile-fail/binop-logic-float.rs ../src/test/compile-fail/binop-logic-int.rs ../src/test/compile-fail/binop-mul-bool.rs ../src/test/compile-fail/binop-typeck.rs ../src/test/compile-fail/block-arg-as-stmt-with-value.rs ../src/test/compile-fail/block-arg-used-as-lambda-with-illegal-cap.rs ../src/test/compile-fail/block-coerce-no-2.rs ../src/test/compile-fail/block-coerce-no.rs ../src/test/compile-fail/block-copy.rs ../src/test/compile-fail/block-deinitializes-upvar.rs ../src/test/compile-fail/block-must-not-have-result-do.rs ../src/test/compile-fail/block-must-not-have-result-for.rs ../src/test/compile-fail/block-must-not-have-result-res.rs ../src/test/compile-fail/block-must-not-have-result-while.rs ../src/test/compile-fail/block-require-return.rs ../src/test/compile-fail/block-uninit.rs ../src/test/compile-fail/bogus-tag.rs ../src/test/compile-fail/break-outside-loop.rs ../src/test/compile-fail/break-uninit.rs ../src/test/compile-fail/break-uninit2.rs ../src/test/compile-fail/cap-clause-both-copy-and-move.rs ../src/test/compile-fail/cap-clause-double-copy.rs ../src/test/compile-fail/cap-clause-double-move.rs ../src/test/compile-fail/cap-clause-illegal-cap.rs ../src/test/compile-fail/cap-clause-move-upvar.rs ../src/test/compile-fail/cap-clause-unresolved-copy.rs ../src/test/compile-fail/cap-clause-unresolved-move.rs ../src/test/compile-fail/cap-clause-use-after-move.rs ../src/test/compile-fail/capture1.rs ../src/test/compile-fail/cast-from-nil.rs ../src/test/compile-fail/cast-to-nil.rs ../src/test/compile-fail/const-recursive.rs ../src/test/compile-fail/constrained-type-missing-check.rs ../src/test/compile-fail/copy-a-resource.rs ../src/test/compile-fail/crateresolve1.rs ../src/test/compile-fail/crateresolve2.rs ../src/test/compile-fail/crateresolve5.rs ../src/test/compile-fail/cross-crate-glob-collision.rs ../src/test/compile-fail/crust-no-bind.rs ../src/test/compile-fail/crust-no-call.rs ../src/test/compile-fail/crust-wrong-value-type.rs ../src/test/compile-fail/ctor-uninit-var.rs ../src/test/compile-fail/dead-code-be.rs ../src/test/compile-fail/dead-code-ret.rs ../src/test/compile-fail/deref-non-pointer.rs ../src/test/compile-fail/do-while-constraints.rs ../src/test/compile-fail/do-while-pred-constraints.rs ../src/test/compile-fail/does-nothing.rs ../src/test/compile-fail/dup-link-name.rs ../src/test/compile-fail/elided-test.rs ../src/test/compile-fail/empty-linkname.rs ../src/test/compile-fail/empty-linkname2.rs ../src/test/compile-fail/empty-record-type.rs ../src/test/compile-fail/export-fully-qualified.rs ../src/test/compile-fail/export-import.rs ../src/test/compile-fail/export-tag-variant.rs ../src/test/compile-fail/export.rs ../src/test/compile-fail/export2.rs ../src/test/compile-fail/ext-after-attrib.rs ../src/test/compile-fail/ext-noname.rs ../src/test/compile-fail/ext-nonexistent.rs ../src/test/compile-fail/extenv-no-args.rs ../src/test/compile-fail/extenv-not-string-literal.rs ../src/test/compile-fail/extenv-too-many-args.rs ../src/test/compile-fail/extfmt-missing-type.rs ../src/test/compile-fail/extfmt-no-args.rs ../src/test/compile-fail/extfmt-non-literal.rs ../src/test/compile-fail/extfmt-non-literal2.rs ../src/test/compile-fail/extfmt-not-enough-args.rs ../src/test/compile-fail/extfmt-too-many-args.rs ../src/test/compile-fail/extfmt-unknown-type.rs ../src/test/compile-fail/extfmt-unsigned-plus.rs ../src/test/compile-fail/extfmt-unsigned-space.rs ../src/test/compile-fail/extfmt-unterminated-conv.rs ../src/test/compile-fail/fail-expr.rs ../src/test/compile-fail/fail-simple.rs ../src/test/compile-fail/fail-type-err.rs ../src/test/compile-fail/fn-bad-block-type.rs ../src/test/compile-fail/fn-bare-bind.rs ../src/test/compile-fail/fn-bare-generic-instantiate1.rs ../src/test/compile-fail/fn-bare-generic-instantiate2.rs ../src/test/compile-fail/fn-compare-mismatch.rs ../src/test/compile-fail/fn-constraint.rs ../src/test/compile-fail/fn-expr-type-state.rs ../src/test/compile-fail/fn-expr-typestate-2.rs ../src/test/compile-fail/fn-variance-1.rs ../src/test/compile-fail/fn-variance-2.rs ../src/test/compile-fail/fn-variance-3.rs ../src/test/compile-fail/for-loop-decl.rs ../src/test/compile-fail/forgot-ret.rs ../src/test/compile-fail/fru-extra-field.rs ../src/test/compile-fail/fru-typestate.rs ../src/test/compile-fail/fully-qualified-type-name1.rs ../src/test/compile-fail/fully-qualified-type-name2.rs ../src/test/compile-fail/fully-qualified-type-name3.rs ../src/test/compile-fail/fully-qualified-type-name4.rs ../src/test/compile-fail/if-branch-types.rs ../src/test/compile-fail/if-check-precond-fail.rs ../src/test/compile-fail/if-typeck.rs ../src/test/compile-fail/if-without-else-result.rs ../src/test/compile-fail/iface-impl-different-num-params.rs ../src/test/compile-fail/iface-test-2.rs ../src/test/compile-fail/iface-test.rs ../src/test/compile-fail/import-from-dup.rs ../src/test/compile-fail/import-from-missing.rs ../src/test/compile-fail/import-from-path.rs ../src/test/compile-fail/import-from-rename.rs ../src/test/compile-fail/import-glob-0.rs ../src/test/compile-fail/import-glob-circular.rs ../src/test/compile-fail/import-glob-export.rs ../src/test/compile-fail/import-glob-multiple.rs ../src/test/compile-fail/import-glob-path.rs ../src/test/compile-fail/import-glob-rename.rs ../src/test/compile-fail/import-loop-2.rs ../src/test/compile-fail/import-loop.rs ../src/test/compile-fail/import.rs ../src/test/compile-fail/import2.rs ../src/test/compile-fail/import3.rs ../src/test/compile-fail/import4.rs ../src/test/compile-fail/import5.rs ../src/test/compile-fail/impure-pred.rs ../src/test/compile-fail/infinite-tag-type-recursion.rs ../src/test/compile-fail/infinite-vec-type-recursion.rs ../src/test/compile-fail/issue-1362.rs ../src/test/compile-fail/issue-1448-1.rs ../src/test/compile-fail/issue-1448-2.rs ../src/test/compile-fail/issue-1655.rs ../src/test/compile-fail/issue-1697.rs ../src/test/compile-fail/issue-1802-1.rs ../src/test/compile-fail/issue-1802-2.rs ../src/test/compile-fail/issue-1900.rs ../src/test/compile-fail/issue-2063-resource.rs ../src/test/compile-fail/issue-2063.rs ../src/test/compile-fail/issue-2149.rs ../src/test/compile-fail/issue-2150.rs ../src/test/compile-fail/issue-2151.rs ../src/test/compile-fail/issue-897-2.rs ../src/test/compile-fail/issue-897.rs ../src/test/compile-fail/lambda-mutate-nested.rs ../src/test/compile-fail/lambda-mutate.rs ../src/test/compile-fail/let-destruct-refutable.rs ../src/test/compile-fail/loop-does-not-diverge.rs ../src/test/compile-fail/macro-2.rs ../src/test/compile-fail/macro.rs ../src/test/compile-fail/main-wrong-type-2.rs ../src/test/compile-fail/main-wrong-type.rs ../src/test/compile-fail/map-types.rs ../src/test/compile-fail/minus-string.rs ../src/test/compile-fail/missing-main.rs ../src/test/compile-fail/missing-return.rs ../src/test/compile-fail/missing-return2.rs ../src/test/compile-fail/mode-inference-fail.rs ../src/test/compile-fail/move-arg.rs ../src/test/compile-fail/multiline-comment-line-tracking.rs ../src/test/compile-fail/mutable-class-fields-2.rs ../src/test/compile-fail/mutable-class-fields.rs ../src/test/compile-fail/mutable-huh-box-assign.rs ../src/test/compile-fail/mutable-huh-field-assign.rs ../src/test/compile-fail/mutable-huh-ptr-assign.rs ../src/test/compile-fail/mutable-huh-unique-assign.rs ../src/test/compile-fail/mutable-huh-variance-box.rs ../src/test/compile-fail/mutable-huh-variance-deep.rs ../src/test/compile-fail/mutable-huh-variance-ptr.rs ../src/test/compile-fail/mutable-huh-variance-rec.rs ../src/test/compile-fail/mutable-huh-variance-unique.rs ../src/test/compile-fail/mutable-huh-variance-vec1.rs ../src/test/compile-fail/mutable-huh-variance-vec2.rs ../src/test/compile-fail/mutable-huh-variance-vec3.rs ../src/test/compile-fail/mutable-huh-variance-vec4.rs ../src/test/compile-fail/mutable-huh-vec-assign.rs ../src/test/compile-fail/name-clash-nullary-2.rs ../src/test/compile-fail/name-clash-nullary.rs ../src/test/compile-fail/native-unsafe-fn-called.rs ../src/test/compile-fail/native-unsafe-fn.rs ../src/test/compile-fail/nested-ty-params.rs ../src/test/compile-fail/no-constraint-prop.rs ../src/test/compile-fail/no-core-attribute.rs ../src/test/compile-fail/noexporttypeexe.rs ../src/test/compile-fail/nolink-with-link-args.rs ../src/test/compile-fail/non-copyable-void.rs ../src/test/compile-fail/non-exhaustive-match-nested.rs ../src/test/compile-fail/non-exhaustive-match.rs ../src/test/compile-fail/nonscalar-cast.rs ../src/test/compile-fail/nonsense-constraints.rs ../src/test/compile-fail/not-a-pred-2.rs ../src/test/compile-fail/not-a-pred-check.rs ../src/test/compile-fail/not-a-pred.rs ../src/test/compile-fail/not-enough-arguments.rs ../src/test/compile-fail/not-pred-args.rs ../src/test/compile-fail/occurs-check-3.rs ../src/test/compile-fail/occurs-check.rs ../src/test/compile-fail/or-init.rs ../src/test/compile-fail/or-patter-mismatch.rs ../src/test/compile-fail/output-type-mismatch.rs ../src/test/compile-fail/oversized-literal.rs ../src/test/compile-fail/pattern-tyvar-2.rs ../src/test/compile-fail/pattern-tyvar.rs ../src/test/compile-fail/pinned-deep-copy.rs ../src/test/compile-fail/placement-new-bad-method-type.rs ../src/test/compile-fail/pred-assign.rs ../src/test/compile-fail/pred-on-wrong-slots.rs ../src/test/compile-fail/pred-swap.rs ../src/test/compile-fail/private-class-field-cross-crate.rs ../src/test/compile-fail/private-class-field.rs ../src/test/compile-fail/private-method-cross-crate.rs ../src/test/compile-fail/private-method.rs ../src/test/compile-fail/qquote-1.rs ../src/test/compile-fail/qquote-2.rs ../src/test/compile-fail/rec-expected.rs ../src/test/compile-fail/rec-extend.rs ../src/test/compile-fail/rec-missing-fields.rs ../src/test/compile-fail/record-with-resource.rs ../src/test/compile-fail/recursive-enum.rs ../src/test/compile-fail/redundant-link-args.rs ../src/test/compile-fail/regions-leaking-ptr.rs ../src/test/compile-fail/regions-nested-fns.rs ../src/test/compile-fail/regions-ret.rs ../src/test/compile-fail/ret-non-nil.rs ../src/test/compile-fail/return-uninit.rs ../src/test/compile-fail/sendfn-captures-nonsendable-state.rs ../src/test/compile-fail/sendfn-is-not-a-lambda.rs ../src/test/compile-fail/slot-as-pred.rs ../src/test/compile-fail/spawn-non-nil-fn.rs ../src/test/compile-fail/swap-no-lval.rs ../src/test/compile-fail/swap-uninit.rs ../src/test/compile-fail/tag-exports-2.rs ../src/test/compile-fail/tag-exports-3.rs ../src/test/compile-fail/tag-exports.rs ../src/test/compile-fail/tag-that-dare-not-speak-its-name.rs ../src/test/compile-fail/tag-type-args.rs ../src/test/compile-fail/tag-variant-cast-non-nullary.rs ../src/test/compile-fail/tag-variant-disr-dup.rs ../src/test/compile-fail/tag-variant-disr-non-nullary.rs ../src/test/compile-fail/tag-variant-disr-type-mismatch.rs ../src/test/compile-fail/tail-non-call.rs ../src/test/compile-fail/tail-typeck.rs ../src/test/compile-fail/terr-in-field.rs ../src/test/compile-fail/terr-sorts.rs ../src/test/compile-fail/tps-invariant-class.rs ../src/test/compile-fail/tps-invariant-enum.rs ../src/test/compile-fail/tps-invariant-iface.rs ../src/test/compile-fail/type-arg-out-of-scope.rs ../src/test/compile-fail/type-mismatch-multiple.rs ../src/test/compile-fail/type-mismatch.rs ../src/test/compile-fail/type-recursive.rs ../src/test/compile-fail/type-shadow.rs ../src/test/compile-fail/unbalanced-comment.rs ../src/test/compile-fail/unbalanced-doublequote.rs ../src/test/compile-fail/uninit-after-item.rs ../src/test/compile-fail/unique-mut.rs ../src/test/compile-fail/unique-pinned-nocopy.rs ../src/test/compile-fail/unique-unique-kind.rs ../src/test/compile-fail/unique-vec-res.rs ../src/test/compile-fail/unreachable-arm.rs ../src/test/compile-fail/unreachable-code-1.rs ../src/test/compile-fail/unreachable-code.rs ../src/test/compile-fail/unsafe-alias-2.rs ../src/test/compile-fail/unsafe-alias.rs ../src/test/compile-fail/unsafe-alt.rs ../src/test/compile-fail/unsafe-fn-assign-deref-ptr.rs ../src/test/compile-fail/unsafe-fn-called-from-safe.rs ../src/test/compile-fail/unsafe-fn-deref-ptr.rs ../src/test/compile-fail/unsafe-fn-used-as-value.rs ../src/test/compile-fail/unsafe-fn-used-in-bind.rs ../src/test/compile-fail/unsafe-mutable-alias.rs ../src/test/compile-fail/unsupported-cast.rs ../src/test/compile-fail/unused-imports-warn.rs ../src/test/compile-fail/use-after-move.rs ../src/test/compile-fail/use-after-send.rs ../src/test/compile-fail/use-meta-dup.rs ../src/test/compile-fail/use-meta-mismatch.rs ../src/test/compile-fail/use-uninit-2.rs ../src/test/compile-fail/use-uninit-3.rs ../src/test/compile-fail/use-uninit.rs ../src/test/compile-fail/vec-add.rs ../src/test/compile-fail/vec-concat-bug.rs ../src/test/compile-fail/vec-field.rs ../src/test/compile-fail/vec-res-add.rs ../src/test/compile-fail/warn-native-int-types.rs ../src/test/compile-fail/while-bypass.rs ../src/test/compile-fail/while-expr.rs ../src/test/compile-fail/while-loop-constraints.rs ../src/test/compile-fail/while-loop-pred-constraints.rs ../src/test/compile-fail/while-type-error.rs ../src/test/compile-fail/writing-through-read-alias.rs ../src/test/compile-fail/writing-through-uninit-vec.rs ../src/test/compile-fail/writing-to-immutable-rec.rs ../src/test/compile-fail/writing-to-immutable-vec.rs ../src/test/compile-fail/wrong-ret-type.rs ../src/test/pretty/attr-fn-inner.rs ../src/test/pretty/blank-lines.rs ../src/test/pretty/block-arg-disambig.rs ../src/test/pretty/block-comment-trailing-whitespace.rs ../src/test/pretty/block-comment-trailing-whitespace2.rs ../src/test/pretty/block-disambig.rs ../src/test/pretty/cap-clause.rs ../src/test/pretty/disamb-stmt-expr.rs ../src/test/pretty/empty-lines.rs ../src/test/pretty/example1.rs ../src/test/pretty/example2.rs ../src/test/pretty/fn-types.rs ../src/test/pretty/issue-929.rs ../src/test/pretty/record-trailing-comma.rs ../src/test/pretty/tag-blank-lines.rs ../src/test/pretty/unary-op-disambig.rs ../src/test/pretty/vec-comments.rs ../src/test/pretty/vec-type.rs ../src/test/run-fail/alt-bot-fail.rs ../src/test/run-fail/alt-disc-bot.rs ../src/test/run-fail/alt-wildcards.rs ../src/test/run-fail/args-fail.rs ../src/test/run-fail/binop-fail-2.rs ../src/test/run-fail/binop-fail.rs ../src/test/run-fail/bug-811.rs ../src/test/run-fail/crust-fail.rs ../src/test/run-fail/do-while-body-fails.rs ../src/test/run-fail/do-while-fail.rs ../src/test/run-fail/explicit-fail-msg.rs ../src/test/run-fail/explicit-fail.rs ../src/test/run-fail/expr-alt-fail-fn.rs ../src/test/run-fail/expr-alt-fail.rs ../src/test/run-fail/expr-fn-fail.rs ../src/test/run-fail/expr-if-fail-fn.rs ../src/test/run-fail/expr-if-fail.rs ../src/test/run-fail/fail-arg.rs ../src/test/run-fail/fail-main.rs ../src/test/run-fail/fail-parens.rs ../src/test/run-fail/fail.rs ../src/test/run-fail/fmt-fail.rs ../src/test/run-fail/fn-constraint-claim.rs ../src/test/run-fail/fn-constraint.rs ../src/test/run-fail/for-each-loop-fail.rs ../src/test/run-fail/if-check-fail.rs ../src/test/run-fail/if-cond-bot.rs ../src/test/run-fail/issue-1459.rs ../src/test/run-fail/issue-2144.rs ../src/test/run-fail/issue-2156.rs ../src/test/run-fail/issue-948.rs ../src/test/run-fail/linked-failure.rs ../src/test/run-fail/linked-failure2.rs ../src/test/run-fail/linked-failure3.rs ../src/test/run-fail/linked-failure4.rs ../src/test/run-fail/morestack1.rs ../src/test/run-fail/morestack2.rs ../src/test/run-fail/morestack3.rs ../src/test/run-fail/morestack4.rs ../src/test/run-fail/port-type.rs ../src/test/run-fail/pred.rs ../src/test/run-fail/rhs-type.rs ../src/test/run-fail/rt-set-exit-status-fail.rs ../src/test/run-fail/rt-set-exit-status-fail2.rs ../src/test/run-fail/rt-set-exit-status.rs ../src/test/run-fail/run-unexported-tests.rs ../src/test/run-fail/spawnfail.rs ../src/test/run-fail/str-overrun.rs ../src/test/run-fail/task-comm-recv-block.rs ../src/test/run-fail/task-spawn-barefn.rs ../src/test/run-fail/too-much-recursion-unwinding.rs ../src/test/run-fail/too-much-recursion.rs ../src/test/run-fail/unique-fail.rs ../src/test/run-fail/unwind-alt.rs ../src/test/run-fail/unwind-assert.rs ../src/test/run-fail/unwind-box-fn-unique.rs ../src/test/run-fail/unwind-box-fn.rs ../src/test/run-fail/unwind-box-iface.rs ../src/test/run-fail/unwind-box-res.rs ../src/test/run-fail/unwind-box-str.rs ../src/test/run-fail/unwind-box-unique-unique.rs ../src/test/run-fail/unwind-box-unique.rs ../src/test/run-fail/unwind-box-vec.rs ../src/test/run-fail/unwind-box.rs ../src/test/run-fail/unwind-check.rs ../src/test/run-fail/unwind-closure.rs ../src/test/run-fail/unwind-fail.rs ../src/test/run-fail/unwind-initializer-indirect.rs ../src/test/run-fail/unwind-initializer.rs ../src/test/run-fail/unwind-interleaved.rs ../src/test/run-fail/unwind-iter.rs ../src/test/run-fail/unwind-iter2.rs ../src/test/run-fail/unwind-lambda.rs ../src/test/run-fail/unwind-misc-1.rs ../src/test/run-fail/unwind-move.rs ../src/test/run-fail/unwind-nested.rs ../src/test/run-fail/unwind-partial-box.rs ../src/test/run-fail/unwind-partial-unique.rs ../src/test/run-fail/unwind-partial-vec.rs ../src/test/run-fail/unwind-rec.rs ../src/test/run-fail/unwind-rec2.rs ../src/test/run-fail/unwind-resource-fail.rs ../src/test/run-fail/unwind-resource-fail2.rs ../src/test/run-fail/unwind-resource-fail3.rs ../src/test/run-fail/unwind-stacked.rs ../src/test/run-fail/unwind-tup.rs ../src/test/run-fail/unwind-tup2.rs ../src/test/run-fail/unwind-uninitialized.rs ../src/test/run-fail/unwind-unique.rs ../src/test/run-fail/vec-overrun.rs ../src/test/run-fail/vec-underrun.rs ../src/test/run-fail/zip-different-lengths.rs ../src/test/run-pass/acyclic-unwind.rs ../src/test/run-pass/alias-uninit-value.rs ../src/test/run-pass/alignment-gep-tup-like-1.rs ../src/test/run-pass/alignment-gep-tup-like-2.rs ../src/test/run-pass/alloca-from-derived-tydesc.rs ../src/test/run-pass/alt-bot-2.rs ../src/test/run-pass/alt-bot.rs ../src/test/run-pass/alt-implicit-copy-unique.rs ../src/test/run-pass/alt-implicit-copy.rs ../src/test/run-pass/alt-join.rs ../src/test/run-pass/alt-path.rs ../src/test/run-pass/alt-pattern-drop.rs ../src/test/run-pass/alt-pattern-lit.rs ../src/test/run-pass/alt-pattern-no-type-params.rs ../src/test/run-pass/alt-pattern-simple.rs ../src/test/run-pass/alt-phi.rs ../src/test/run-pass/alt-range.rs ../src/test/run-pass/alt-str.rs ../src/test/run-pass/alt-tag.rs ../src/test/run-pass/alt-type-simple.rs ../src/test/run-pass/alt-with-ret-arm.rs ../src/test/run-pass/argument-passing.rs ../src/test/run-pass/argv.rs ../src/test/run-pass/arith-0.rs ../src/test/run-pass/arith-1.rs ../src/test/run-pass/arith-2.rs ../src/test/run-pass/arith-unsigned.rs ../src/test/run-pass/artificial-block.rs ../src/test/run-pass/assign-assign.rs ../src/test/run-pass/auto-instantiate.rs ../src/test/run-pass/auto-loop.rs ../src/test/run-pass/auto_serialize.rs ../src/test/run-pass/autobind.rs ../src/test/run-pass/basic-1.rs ../src/test/run-pass/basic-2.rs ../src/test/run-pass/basic.rs ../src/test/run-pass/big-literals.rs ../src/test/run-pass/binary-minus-without-space.rs ../src/test/run-pass/bind-exterior.rs ../src/test/run-pass/bind-generic.rs ../src/test/run-pass/bind-interior.rs ../src/test/run-pass/bind-methods.rs ../src/test/run-pass/bind-native-fn.rs ../src/test/run-pass/bind-native.rs ../src/test/run-pass/bind-parameterized-args-2.rs ../src/test/run-pass/bind-parameterized-args.rs ../src/test/run-pass/bind-thunk.rs ../src/test/run-pass/bind-trivial.rs ../src/test/run-pass/binops.rs ../src/test/run-pass/bitwise.rs ../src/test/run-pass/block-arg-call-as.rs ../src/test/run-pass/block-arg-can-be-followed-by-binop.rs ../src/test/run-pass/block-arg-can-be-followed-by-block-arg.rs ../src/test/run-pass/block-arg-can-be-followed-by-call.rs ../src/test/run-pass/block-arg-in-parentheses.rs ../src/test/run-pass/block-arg-used-as-any.rs ../src/test/run-pass/block-arg-used-as-lambda.rs ../src/test/run-pass/block-arg.rs ../src/test/run-pass/block-explicit-types.rs ../src/test/run-pass/block-expr-precedence.rs ../src/test/run-pass/block-fn-coerce.rs ../src/test/run-pass/block-iter-1.rs ../src/test/run-pass/block-iter-2.rs ../src/test/run-pass/block-vec-map2.rs ../src/test/run-pass/bool-not.rs ../src/test/run-pass/box-compare.rs ../src/test/run-pass/box-in-tup.rs ../src/test/run-pass/box-inside-if.rs ../src/test/run-pass/box-inside-if2.rs ../src/test/run-pass/box-pattern.rs ../src/test/run-pass/box-unbox.rs ../src/test/run-pass/box.rs ../src/test/run-pass/break-value.rs ../src/test/run-pass/break.rs ../src/test/run-pass/bug-862.rs ../src/test/run-pass/c-stack-as-value.rs ../src/test/run-pass/c-stack-returning-int64.rs ../src/test/run-pass/cap-clause-move.rs ../src/test/run-pass/cap-clause-not-used.rs ../src/test/run-pass/cast.rs ../src/test/run-pass/cci_impl_exe.rs ../src/test/run-pass/cci_iter_exe.rs ../src/test/run-pass/cci_nested_exe.rs ../src/test/run-pass/cci_no_inline_exe.rs ../src/test/run-pass/chan-leak.rs ../src/test/run-pass/char.rs ../src/test/run-pass/check-pattern-bound.rs ../src/test/run-pass/child-outlives-parent.rs ../src/test/run-pass/claim-nonterm.rs ../src/test/run-pass/class-method-cross-crate.rs ../src/test/run-pass/class-methods-cross-crate.rs ../src/test/run-pass/class-methods.rs ../src/test/run-pass/class-poly-methods-cross-crate.rs ../src/test/run-pass/class-poly-methods.rs ../src/test/run-pass/class-str-field.rs ../src/test/run-pass/class-typarams.rs ../src/test/run-pass/classes-cross-crate.rs ../src/test/run-pass/classes-simple-cross-crate.rs ../src/test/run-pass/classes-simple-method.rs ../src/test/run-pass/classes-simple.rs ../src/test/run-pass/classes.rs ../src/test/run-pass/cleanup-copy-mode.rs ../src/test/run-pass/clone-with-exterior.rs ../src/test/run-pass/close-over-big-then-small-data.rs ../src/test/run-pass/closure-inference.rs ../src/test/run-pass/closure-inference2.rs ../src/test/run-pass/comm.rs ../src/test/run-pass/command-line-args.rs ../src/test/run-pass/companionmod.rs ../src/test/run-pass/complex.rs ../src/test/run-pass/conditional-compile-arch.rs ../src/test/run-pass/conditional-compile.rs ../src/test/run-pass/const-const.rs ../src/test/run-pass/const-contents.rs ../src/test/run-pass/const-negative.rs ../src/test/run-pass/const.rs ../src/test/run-pass/constrained-type.rs ../src/test/run-pass/constraint-prop-expr-move.rs ../src/test/run-pass/constraint-prop-move.rs ../src/test/run-pass/constraint-prop-swap.rs ../src/test/run-pass/constraint-prop.rs ../src/test/run-pass/core-export-f64-sqrt.rs ../src/test/run-pass/crateresolve1.rs ../src/test/run-pass/crateresolve2.rs ../src/test/run-pass/crateresolve3.rs ../src/test/run-pass/crateresolve4.rs ../src/test/run-pass/crateresolve5.rs ../src/test/run-pass/crateresolve6.rs ../src/test/run-pass/crateresolve7.rs ../src/test/run-pass/crust-1.rs ../src/test/run-pass/crust-call-deep.rs ../src/test/run-pass/crust-call-deep2.rs ../src/test/run-pass/crust-call-scrub.rs ../src/test/run-pass/crust-call.rs ../src/test/run-pass/crust-stress.rs ../src/test/run-pass/crust-take-value.rs ../src/test/run-pass/crust-yield.rs ../src/test/run-pass/cycle-collection.rs ../src/test/run-pass/cycle-collection2.rs ../src/test/run-pass/cycle-collection4.rs ../src/test/run-pass/cycle-collection5.rs ../src/test/run-pass/dead-code-one-arm-if.rs ../src/test/run-pass/decl-with-recv.rs ../src/test/run-pass/deep.rs ../src/test/run-pass/deref-lval.rs ../src/test/run-pass/deref.rs ../src/test/run-pass/div-mod.rs ../src/test/run-pass/double-unbox.rs ../src/test/run-pass/drop-bind-thunk-args.rs ../src/test/run-pass/drop-on-empty-block-exit.rs ../src/test/run-pass/drop-on-ret.rs ../src/test/run-pass/drop-parametric-closure-with-bound-box.rs ../src/test/run-pass/early-ret-binop-add.rs ../src/test/run-pass/early-ret-binop.rs ../src/test/run-pass/else-if.rs ../src/test/run-pass/empty-mutable-vec.rs ../src/test/run-pass/empty-tag.rs ../src/test/run-pass/enum-disr-val-pretty.rs ../src/test/run-pass/estr-internal.rs ../src/test/run-pass/estr-shared.rs ../src/test/run-pass/estr-slice.rs ../src/test/run-pass/estr-uniq.rs ../src/test/run-pass/export-abstract-tag.rs ../src/test/run-pass/export-glob-imports-target.rs ../src/test/run-pass/export-glob.rs ../src/test/run-pass/export-multi.rs ../src/test/run-pass/export-non-interference.rs ../src/test/run-pass/export-non-interference2.rs ../src/test/run-pass/export-non-interference3.rs ../src/test/run-pass/export-tag-variant.rs ../src/test/run-pass/export-unexported-dep.rs ../src/test/run-pass/expr-alt-box.rs ../src/test/run-pass/expr-alt-fail-all.rs ../src/test/run-pass/expr-alt-fail.rs ../src/test/run-pass/expr-alt-generic-box1.rs ../src/test/run-pass/expr-alt-generic-box2.rs ../src/test/run-pass/expr-alt-generic-unique1.rs ../src/test/run-pass/expr-alt-generic-unique2.rs ../src/test/run-pass/expr-alt-generic.rs ../src/test/run-pass/expr-alt-struct.rs ../src/test/run-pass/expr-alt-unique.rs ../src/test/run-pass/expr-alt.rs ../src/test/run-pass/expr-block-box.rs ../src/test/run-pass/expr-block-fn.rs ../src/test/run-pass/expr-block-generic-box1.rs ../src/test/run-pass/expr-block-generic-box2.rs ../src/test/run-pass/expr-block-generic-unique1.rs ../src/test/run-pass/expr-block-generic-unique2.rs ../src/test/run-pass/expr-block-generic.rs ../src/test/run-pass/expr-block-ref.rs ../src/test/run-pass/expr-block-slot.rs ../src/test/run-pass/expr-block-unique.rs ../src/test/run-pass/expr-block.rs ../src/test/run-pass/expr-copy.rs ../src/test/run-pass/expr-elseif-ref.rs ../src/test/run-pass/expr-elseif-ref2.rs ../src/test/run-pass/expr-empty-ret.rs ../src/test/run-pass/expr-fn.rs ../src/test/run-pass/expr-if-box.rs ../src/test/run-pass/expr-if-fail-all.rs ../src/test/run-pass/expr-if-fail.rs ../src/test/run-pass/expr-if-generic-box1.rs ../src/test/run-pass/expr-if-generic-box2.rs ../src/test/run-pass/expr-if-generic.rs ../src/test/run-pass/expr-if-struct.rs ../src/test/run-pass/expr-if-unique.rs ../src/test/run-pass/expr-if.rs ../src/test/run-pass/expr-scope.rs ../src/test/run-pass/exterior.rs ../src/test/run-pass/fact.rs ../src/test/run-pass/fixed-point-bind-box.rs ../src/test/run-pass/fixed-point-bind-unique.rs ../src/test/run-pass/float-nan.rs ../src/test/run-pass/float-signature.rs ../src/test/run-pass/float.rs ../src/test/run-pass/float2.rs ../src/test/run-pass/floatlits.rs ../src/test/run-pass/fn-bare-assign.rs ../src/test/run-pass/fn-bare-bind-generic.rs ../src/test/run-pass/fn-bare-bind.rs ../src/test/run-pass/fn-bare-coerce-to-block.rs ../src/test/run-pass/fn-bare-coerce-to-shared.rs ../src/test/run-pass/fn-bare-item.rs ../src/test/run-pass/fn-bare-size.rs ../src/test/run-pass/fn-bare-spawn.rs ../src/test/run-pass/fn-coerce-field.rs ../src/test/run-pass/fn-constraint.rs ../src/test/run-pass/fn-lval.rs ../src/test/run-pass/fn-type-infer.rs ../src/test/run-pass/for-destruct.rs ../src/test/run-pass/for-loop-fail.rs ../src/test/run-pass/foreach-nested.rs ../src/test/run-pass/foreach-put-structured.rs ../src/test/run-pass/foreach-simple-outer-slot.rs ../src/test/run-pass/fun-call-variants.rs ../src/test/run-pass/fun-indirect-call.rs ../src/test/run-pass/generic-alias-box.rs ../src/test/run-pass/generic-alias-unique.rs ../src/test/run-pass/generic-bind-2.rs ../src/test/run-pass/generic-bind.rs ../src/test/run-pass/generic-box.rs ../src/test/run-pass/generic-derived-type.rs ../src/test/run-pass/generic-drop-glue.rs ../src/test/run-pass/generic-exterior-box.rs ../src/test/run-pass/generic-exterior-unique.rs ../src/test/run-pass/generic-fn-box.rs ../src/test/run-pass/generic-fn-infer.rs ../src/test/run-pass/generic-fn-twice.rs ../src/test/run-pass/generic-fn-unique.rs ../src/test/run-pass/generic-fn.rs ../src/test/run-pass/generic-ivec-leak.rs ../src/test/run-pass/generic-ivec.rs ../src/test/run-pass/generic-recursive-tag.rs ../src/test/run-pass/generic-tag-alt.rs ../src/test/run-pass/generic-tag-corruption.rs ../src/test/run-pass/generic-tag-local.rs ../src/test/run-pass/generic-tag-values.rs ../src/test/run-pass/generic-tag.rs ../src/test/run-pass/generic-temporary.rs ../src/test/run-pass/generic-tup.rs ../src/test/run-pass/generic-type-synonym.rs ../src/test/run-pass/generic-type.rs ../src/test/run-pass/generic-unique.rs ../src/test/run-pass/global-scope.rs ../src/test/run-pass/guards.rs ../src/test/run-pass/hashmap-memory.rs ../src/test/run-pass/hello.rs ../src/test/run-pass/i32-sub.rs ../src/test/run-pass/i8-incr.rs ../src/test/run-pass/if-bot.rs ../src/test/run-pass/if-check-precond.rs ../src/test/run-pass/if-check.rs ../src/test/run-pass/if-ret.rs ../src/test/run-pass/iface-cast.rs ../src/test/run-pass/iface-generic.rs ../src/test/run-pass/iface-to-str.rs ../src/test/run-pass/impl-variance.rs ../src/test/run-pass/import-from-native.rs ../src/test/run-pass/import-from.rs ../src/test/run-pass/import-glob-0.rs ../src/test/run-pass/import-glob-1.rs ../src/test/run-pass/import-glob-circular.rs ../src/test/run-pass/import-glob-crate.rs ../src/test/run-pass/import-in-block.rs ../src/test/run-pass/import.rs ../src/test/run-pass/import2.rs ../src/test/run-pass/import3.rs ../src/test/run-pass/import4.rs ../src/test/run-pass/import5.rs ../src/test/run-pass/import6.rs ../src/test/run-pass/import7.rs ../src/test/run-pass/import8.rs ../src/test/run-pass/infer-fn-tail-expr.rs ../src/test/run-pass/infinite-loops.rs ../src/test/run-pass/init-res-into-things.rs ../src/test/run-pass/inner-module.rs ../src/test/run-pass/int.rs ../src/test/run-pass/integral-indexing.rs ../src/test/run-pass/invoke-external-native.rs ../src/test/run-pass/issue-1112.rs ../src/test/run-pass/issue-1251.rs ../src/test/run-pass/issue-1257.rs ../src/test/run-pass/issue-1460.rs ../src/test/run-pass/issue-1660.rs ../src/test/run-pass/issue-1696.rs ../src/test/run-pass/issue-1821.rs ../src/test/run-pass/issue-1895.rs ../src/test/run-pass/issue-1899.rs ../src/test/run-pass/issue-1974.rs ../src/test/run-pass/issue-333.rs ../src/test/run-pass/issue-506.rs ../src/test/run-pass/issue-507.rs ../src/test/run-pass/issue-511.rs ../src/test/run-pass/issue-687.rs ../src/test/run-pass/issue-783.rs ../src/test/run-pass/issue-898.rs ../src/test/run-pass/issue-933.rs ../src/test/run-pass/issue-970.rs ../src/test/run-pass/issue-979.rs ../src/test/run-pass/issue-980.rs ../src/test/run-pass/issue2170exe.rs ../src/test/run-pass/istr.rs ../src/test/run-pass/item-attributes.rs ../src/test/run-pass/item-name-overload.rs ../src/test/run-pass/iter-range.rs ../src/test/run-pass/ivec-add.rs ../src/test/run-pass/ivec-pass-by-value.rs ../src/test/run-pass/ivec-tag.rs ../src/test/run-pass/lambda-infer-unresolved.rs ../src/test/run-pass/lambda-no-leak.rs ../src/test/run-pass/large-records.rs ../src/test/run-pass/last-use-corner-cases.rs ../src/test/run-pass/last-use-in-block.rs ../src/test/run-pass/last-use-in-cap-clause.rs ../src/test/run-pass/last-use-is-capture.rs ../src/test/run-pass/lazy-and-or.rs ../src/test/run-pass/lazy-init.rs ../src/test/run-pass/lazychan.rs ../src/test/run-pass/leak-box-as-tydesc.rs ../src/test/run-pass/leak-tag-copy.rs ../src/test/run-pass/leak-unique-as-tydesc.rs ../src/test/run-pass/let-destruct-fresh-mem.rs ../src/test/run-pass/let-destruct.rs ../src/test/run-pass/linear-for-loop.rs ../src/test/run-pass/list.rs ../src/test/run-pass/log-err-phi.rs ../src/test/run-pass/log-knows-the-names-of-variants-in-std.rs ../src/test/run-pass/log-knows-the-names-of-variants.rs ../src/test/run-pass/log-linearized.rs ../src/test/run-pass/log-str.rs ../src/test/run-pass/long-while.rs ../src/test/run-pass/loop-break-cont-1.rs ../src/test/run-pass/loop-break-cont.rs ../src/test/run-pass/loop-diverges.rs ../src/test/run-pass/loop-scope.rs ../src/test/run-pass/lots-a-fail.rs ../src/test/run-pass/macro-2.rs ../src/test/run-pass/macro-3.rs ../src/test/run-pass/macro-by-example-1.rs ../src/test/run-pass/macro-by-example-2.rs ../src/test/run-pass/macro.rs ../src/test/run-pass/main-ivec.rs ../src/test/run-pass/many.rs ../src/test/run-pass/maybe-mutable.rs ../src/test/run-pass/method-attributes.rs ../src/test/run-pass/mlist-cycle.rs ../src/test/run-pass/mlist.rs ../src/test/run-pass/mod-view-items.rs ../src/test/run-pass/monad.rs ../src/test/run-pass/monomorphize-iface-in-fn-at.rs ../src/test/run-pass/morestack1.rs ../src/test/run-pass/morestack2.rs ../src/test/run-pass/morestack3.rs ../src/test/run-pass/morestack4.rs ../src/test/run-pass/morestack5.rs ../src/test/run-pass/morestack6.rs ../src/test/run-pass/move-1-unique.rs ../src/test/run-pass/move-1.rs ../src/test/run-pass/move-2-unique.rs ../src/test/run-pass/move-2.rs ../src/test/run-pass/move-3-unique.rs ../src/test/run-pass/move-3.rs ../src/test/run-pass/move-4-unique.rs ../src/test/run-pass/move-4.rs ../src/test/run-pass/move-arg-2-unique.rs ../src/test/run-pass/move-arg-2.rs ../src/test/run-pass/move-arg.rs ../src/test/run-pass/move-nullary-fn.rs ../src/test/run-pass/move-scalar.rs ../src/test/run-pass/multi-let.rs ../src/test/run-pass/multiline-comment.rs ../src/test/run-pass/mutable-alias-vec.rs ../src/test/run-pass/mutable-huh-variance-vec1.rs ../src/test/run-pass/mutable-huh-variance-vec2.rs ../src/test/run-pass/mutable-vec-drop.rs ../src/test/run-pass/mutual-recursion-group.rs ../src/test/run-pass/native-dupe.rs ../src/test/run-pass/native-fn-linkname.rs ../src/test/run-pass/native-no-abi.rs ../src/test/run-pass/native2.rs ../src/test/run-pass/negative.rs ../src/test/run-pass/nested-alts.rs ../src/test/run-pass/nested-exhaustive-alt.rs ../src/test/run-pass/nested-pattern.rs ../src/test/run-pass/nested-patterns.rs ../src/test/run-pass/newtype-polymorphic.rs ../src/test/run-pass/newtype.rs ../src/test/run-pass/nil-decl-in-native.rs ../src/test/run-pass/nil-pattern.rs ../src/test/run-pass/non-boolean-pure-fns.rs ../src/test/run-pass/nullary-or-pattern.rs ../src/test/run-pass/opeq.rs ../src/test/run-pass/operator-associativity.rs ../src/test/run-pass/operator-overloading.rs ../src/test/run-pass/option-ext.rs ../src/test/run-pass/or-pattern.rs ../src/test/run-pass/osmain.rs ../src/test/run-pass/output-slot-variants.rs ../src/test/run-pass/over-constrained-vregs.rs ../src/test/run-pass/paren-free.rs ../src/test/run-pass/parse-fail.rs ../src/test/run-pass/pass-by-copy.rs ../src/test/run-pass/path.rs ../src/test/run-pass/pattern-bound-var-in-for-each.rs ../src/test/run-pass/placement-new-arena.rs ../src/test/run-pass/placement-new-leaky.rs ../src/test/run-pass/pred-check.rs ../src/test/run-pass/pred-not-bool.rs ../src/test/run-pass/pred.rs ../src/test/run-pass/preempt.rs ../src/test/run-pass/private-class-field.rs ../src/test/run-pass/private-method.rs ../src/test/run-pass/qquote.rs ../src/test/run-pass/readalias.rs ../src/test/run-pass/rebind-fn.rs ../src/test/run-pass/rec-auto.rs ../src/test/run-pass/rec-extend.rs ../src/test/run-pass/rec-tup.rs ../src/test/run-pass/rec.rs ../src/test/run-pass/record-pat.rs ../src/test/run-pass/regions-addr-of-ret.rs ../src/test/run-pass/regions-bot.rs ../src/test/run-pass/regions-mock-trans-impls.rs ../src/test/run-pass/regions-mock-trans.rs ../src/test/run-pass/regions-params.rs ../src/test/run-pass/regions-self-impls.rs ../src/test/run-pass/regions-self-in-enums.rs ../src/test/run-pass/regions-simple.rs ../src/test/run-pass/resource-assign-is-not-copy.rs ../src/test/run-pass/resource-cycle.rs ../src/test/run-pass/resource-cycle2.rs ../src/test/run-pass/resource-destruct.rs ../src/test/run-pass/resource-generic.rs ../src/test/run-pass/resource-in-struct.rs ../src/test/run-pass/ret-bang.rs ../src/test/run-pass/ret-break-cont-in-block.rs ../src/test/run-pass/ret-none.rs ../src/test/run-pass/return-nil.rs ../src/test/run-pass/rt-circular-buffer.rs ../src/test/run-pass/rt-sched-1.rs ../src/test/run-pass/self-shadowing-import.rs ../src/test/run-pass/send-iloop.rs ../src/test/run-pass/send-type-inference.rs ../src/test/run-pass/sendfn-deep-copy.rs ../src/test/run-pass/sendfn-generic-fn.rs ../src/test/run-pass/sendfn-is-a-block.rs ../src/test/run-pass/sendfn-spawn-with-fn-arg.rs ../src/test/run-pass/seq-compare.rs ../src/test/run-pass/shadow.rs ../src/test/run-pass/shape_intrinsic_tag_then_rec.rs ../src/test/run-pass/shift.rs ../src/test/run-pass/simple-alt-generic-tag.rs ../src/test/run-pass/simple-generic-alt.rs ../src/test/run-pass/simple-generic-tag.rs ../src/test/run-pass/simple-infer.rs ../src/test/run-pass/size-and-align.rs ../src/test/run-pass/spawn-fn.rs ../src/test/run-pass/spawn-types.rs ../src/test/run-pass/spawn.rs ../src/test/run-pass/spawn2.rs ../src/test/run-pass/stable-addr-of.rs ../src/test/run-pass/static-impl.rs ../src/test/run-pass/str-append.rs ../src/test/run-pass/str-concat.rs ../src/test/run-pass/str-growth.rs ../src/test/run-pass/str-idx.rs ../src/test/run-pass/str-multiline.rs ../src/test/run-pass/string-self-append.rs ../src/test/run-pass/struct-return.rs ../src/test/run-pass/structured-compare-recursive.rs ../src/test/run-pass/structured-compare.rs ../src/test/run-pass/supported-cast.rs ../src/test/run-pass/swap-1.rs ../src/test/run-pass/swap-2.rs ../src/test/run-pass/syntax-extension-fmt.rs ../src/test/run-pass/syntax-extension-minor.rs ../src/test/run-pass/syntax-extension-shell.rs ../src/test/run-pass/tag-align-dyn-u64.rs ../src/test/run-pass/tag-align-dyn-variants.rs ../src/test/run-pass/tag-align-shape.rs ../src/test/run-pass/tag-align-u64.rs ../src/test/run-pass/tag-auto-disr-val-shape.rs ../src/test/run-pass/tag-disr-val-shape.rs ../src/test/run-pass/tag-exports.rs ../src/test/run-pass/tag-in-block.rs ../src/test/run-pass/tag-variant-disr-val.rs ../src/test/run-pass/tag.rs ../src/test/run-pass/tail-call-arg-leak.rs ../src/test/run-pass/tail-cps.rs ../src/test/run-pass/tail-direct.rs ../src/test/run-pass/task-comm-0.rs ../src/test/run-pass/task-comm-1.rs ../src/test/run-pass/task-comm-10.rs ../src/test/run-pass/task-comm-11.rs ../src/test/run-pass/task-comm-12.rs ../src/test/run-pass/task-comm-13.rs ../src/test/run-pass/task-comm-14.rs ../src/test/run-pass/task-comm-15.rs ../src/test/run-pass/task-comm-16.rs ../src/test/run-pass/task-comm-17.rs ../src/test/run-pass/task-comm-3.rs ../src/test/run-pass/task-comm-4.rs ../src/test/run-pass/task-comm-5.rs ../src/test/run-pass/task-comm-6.rs ../src/test/run-pass/task-comm-7.rs ../src/test/run-pass/task-comm-9.rs ../src/test/run-pass/task-comm-chan-cleanup.rs ../src/test/run-pass/task-comm-chan-cleanup2.rs ../src/test/run-pass/task-comm-chan-cleanup3.rs ../src/test/run-pass/task-comm-chan-cleanup4.rs ../src/test/run-pass/task-comm-chan-nil.rs ../src/test/run-pass/task-comm.rs ../src/test/run-pass/task-compare.rs ../src/test/run-pass/task-killjoin-rsrc.rs ../src/test/run-pass/task-killjoin.rs ../src/test/run-pass/task-life-0.rs ../src/test/run-pass/task-spawn-move-and-copy.rs ../src/test/run-pass/terminate-in-initializer.rs ../src/test/run-pass/test-ignore-cfg.rs ../src/test/run-pass/test-runner-hides-main.rs ../src/test/run-pass/threads.rs ../src/test/run-pass/too-much-recursion.rs ../src/test/run-pass/trivial-message.rs ../src/test/run-pass/tup.rs ../src/test/run-pass/type-in-nested-module.rs ../src/test/run-pass/type-namespace.rs ../src/test/run-pass/type-param-constraints.rs ../src/test/run-pass/type-param.rs ../src/test/run-pass/type-params-in-for-each.rs ../src/test/run-pass/type-ptr.rs ../src/test/run-pass/type-sizes.rs ../src/test/run-pass/typestate-cfg-nesting.rs ../src/test/run-pass/typestate-multi-decl.rs ../src/test/run-pass/typestate-transitive.rs ../src/test/run-pass/u32-decr.rs ../src/test/run-pass/u8-incr-decr.rs ../src/test/run-pass/u8-incr.rs ../src/test/run-pass/uint.rs ../src/test/run-pass/unchecked-predicates.rs ../src/test/run-pass/unify-return-ty.rs ../src/test/run-pass/uniq-cc-generic.rs ../src/test/run-pass/uniq-cc.rs ../src/test/run-pass/unique-alt-discrim.rs ../src/test/run-pass/unique-assign-copy.rs ../src/test/run-pass/unique-assign-drop.rs ../src/test/run-pass/unique-assign-generic.rs ../src/test/run-pass/unique-assign.rs ../src/test/run-pass/unique-autoderef-field.rs ../src/test/run-pass/unique-autoderef-index.rs ../src/test/run-pass/unique-cmp.rs ../src/test/run-pass/unique-containing-tag.rs ../src/test/run-pass/unique-copy-box.rs ../src/test/run-pass/unique-create.rs ../src/test/run-pass/unique-decl-init-copy.rs ../src/test/run-pass/unique-decl-init.rs ../src/test/run-pass/unique-decl-move-temp.rs ../src/test/run-pass/unique-decl-move.rs ../src/test/run-pass/unique-decl.rs ../src/test/run-pass/unique-deref.rs ../src/test/run-pass/unique-destructure.rs ../src/test/run-pass/unique-drop-complex.rs ../src/test/run-pass/unique-fn-arg-move.rs ../src/test/run-pass/unique-fn-arg-mut.rs ../src/test/run-pass/unique-fn-arg.rs ../src/test/run-pass/unique-fn-ret.rs ../src/test/run-pass/unique-generic-assign.rs ../src/test/run-pass/unique-in-tag.rs ../src/test/run-pass/unique-in-vec-copy.rs ../src/test/run-pass/unique-in-vec.rs ../src/test/run-pass/unique-init.rs ../src/test/run-pass/unique-kinds.rs ../src/test/run-pass/unique-log.rs ../src/test/run-pass/unique-move-drop.rs ../src/test/run-pass/unique-move-temp.rs ../src/test/run-pass/unique-move.rs ../src/test/run-pass/unique-mutable.rs ../src/test/run-pass/unique-pat-2.rs ../src/test/run-pass/unique-pat-3.rs ../src/test/run-pass/unique-pat.rs ../src/test/run-pass/unique-pinned-nocopy-2.rs ../src/test/run-pass/unique-rec.rs ../src/test/run-pass/unique-send-2.rs ../src/test/run-pass/unique-send.rs ../src/test/run-pass/unique-swap.rs ../src/test/run-pass/unit.rs ../src/test/run-pass/unreachable-code.rs ../src/test/run-pass/unsafe-fn-called-from-unsafe-blk.rs ../src/test/run-pass/unsafe-fn-called-from-unsafe-fn.rs ../src/test/run-pass/unused-move-capture.rs ../src/test/run-pass/unwind-box.rs ../src/test/run-pass/unwind-resource.rs ../src/test/run-pass/unwind-resource2.rs ../src/test/run-pass/unwind-unique.rs ../src/test/run-pass/use-crate-name-alias.rs ../src/test/run-pass/use-iface-before-def.rs ../src/test/run-pass/use-import-export.rs ../src/test/run-pass/use-uninit-alt.rs ../src/test/run-pass/use-uninit-alt2.rs ../src/test/run-pass/use.rs ../src/test/run-pass/user.rs ../src/test/run-pass/utf8.rs ../src/test/run-pass/utf8_chars.rs ../src/test/run-pass/utf8_idents.rs ../src/test/run-pass/variant-attributes.rs ../src/test/run-pass/vec-concat.rs ../src/test/run-pass/vec-drop.rs ../src/test/run-pass/vec-growth.rs ../src/test/run-pass/vec-ivec-deadlock.rs ../src/test/run-pass/vec-late-init.rs ../src/test/run-pass/vec-push.rs ../src/test/run-pass/vec-self-append.rs ../src/test/run-pass/vec-slice.rs ../src/test/run-pass/vec.rs ../src/test/run-pass/vector-no-ann-2.rs ../src/test/run-pass/vector-no-ann.rs ../src/test/run-pass/weird-exprs.rs ../src/test/run-pass/while-and-do-while.rs ../src/test/run-pass/while-cont.rs ../src/test/run-pass/while-flow-graph.rs ../src/test/run-pass/while-loop-constraints-2.rs ../src/test/run-pass/while-prelude-drop.rs ../src/test/run-pass/while-with-break.rs ../src/test/run-pass/writealias.rs ../src/test/run-pass/x86stdcall.rs ../src/test/run-pass/x86stdcall2.rs ../src/test/run-pass/yield.rs ../src/test/run-pass/yield1.rs ../src/test/run-pass/yield2.rs ../src/test/run-pass/zip-same-length.rs ../src/test/run-pass/companionmod-src/b.rs ../src/test/run-pass/companionmod-src/d.rs ../src/test/run-pass/crate-attributes-src/foo.rs ../src/test/run-pass/multi-src/bar.rs ../src/test/run-pass/multi-src/foo.rs ../src/test/run-pass/native-mod-src/inner.rs ../src/test/run-pass/native-src/native.rs ../src/test/compile-fail/attr-bad-crate-attr.rc ../src/test/compile-fail/missingmod.rc ../src/test/compile-fail/use-meta.rc ../src/test/run-pass/companionmod.rc ../src/test/run-pass/crate-attributes.rc ../src/test/run-pass/dupe-first-attr.rc ../src/test/run-pass/multi.rc ../src/test/run-pass/native-mod.rc ../src/test/run-pass/native.rc \ | |
| | xargs -n 10 python ../src/etc/tidy.py | |
| echo \ | |
| ../src/rt/boxed_region.cpp ../src/rt/circular_buffer.cpp ../src/rt/memory_region.cpp ../src/rt/rust.cpp ../src/rt/rust_abi.cpp ../src/rt/rust_box_annihilator.cpp ../src/rt/rust_builtin.cpp ../src/rt/rust_cc.cpp ../src/rt/rust_debug.cpp ../src/rt/rust_env.cpp ../src/rt/rust_kernel.cpp ../src/rt/rust_log.cpp ../src/rt/rust_port.cpp ../src/rt/rust_port_selector.cpp ../src/rt/rust_run_program.cpp ../src/rt/rust_sched_driver.cpp ../src/rt/rust_sched_launcher.cpp ../src/rt/rust_sched_loop.cpp ../src/rt/rust_sched_reaper.cpp ../src/rt/rust_scheduler.cpp ../src/rt/rust_shape.cpp ../src/rt/rust_stack.cpp ../src/rt/rust_task.cpp ../src/rt/rust_upcall.cpp ../src/rt/rust_uv.cpp ../src/rt/isaac/randport.cpp ../src/rt/sync/lock_and_signal.cpp ../src/rt/sync/lock_free_queue.cpp ../src/rt/sync/rust_thread.cpp ../src/rt/sync/timer.cpp ../src/rt/arch/i386/context.cpp ../src/rt/arch/i386/gpr.cpp ../src/rt/arch/x86_64/context.cpp ../src/rt/arch/x86_64/gpr.cpp \ | |
| ../src/rt/boxed_region.h ../src/rt/circular_buffer.h ../src/rt/memory_region.h ../src/rt/rust_abi.h ../src/rt/rust_cc.h ../src/rt/rust_debug.h ../src/rt/rust_env.h ../src/rt/rust_globals.h ../src/rt/rust_gpr_base.h ../src/rt/rust_kernel.h ../src/rt/rust_log.h ../src/rt/rust_port.h ../src/rt/rust_port_selector.h ../src/rt/rust_refcount.h ../src/rt/rust_sched_driver.h ../src/rt/rust_sched_launcher.h ../src/rt/rust_sched_loop.h ../src/rt/rust_sched_reaper.h ../src/rt/rust_scheduler.h ../src/rt/rust_shape.h ../src/rt/rust_signal.h ../src/rt/rust_stack.h ../src/rt/rust_task.h ../src/rt/rust_type.h ../src/rt/rust_unwind.h ../src/rt/rust_upcall.h ../src/rt/rust_util.h ../src/rt/bigint/low_primes.h ../src/rt/isaac/rand.h ../src/rt/isaac/standard.h ../src/rt/sync/lock_and_signal.h ../src/rt/sync/lock_free_queue.h ../src/rt/sync/rust_thread.h ../src/rt/sync/sync.h ../src/rt/sync/timer.h ../src/rt/util/array_list.h ../src/rt/util/hash_map.h ../src/rt/util/indexed_list.h ../src/rt/arch/i386/context.h ../src/rt/arch/i386/gpr.h ../src/rt/arch/i386/regs.h ../src/rt/arch/x86_64/context.h ../src/rt/arch/x86_64/gpr.h ../src/rt/arch/x86_64/regs.h \ | |
| | xargs -n 10 python ../src/etc/tidy.py | |
| ../src/etc/get-snapshot.py x86_64-apple-darwin | |
| determined most recent snapshot: rust-stage0-2012-04-04-1ad62de-macos-x86_64-035497d8e19d350789992943a0684981c4af610f.tar.bz2 | |
| got download with ok hash | |
| opening snapshot dl/rust-stage0-2012-04-04-1ad62de-macos-x86_64-035497d8e19d350789992943a0684981c4af610f.tar.bz2 | |
| extracting rust-stage0/bin/rustc | |
| extracting rust-stage0/lib/libcore-d27e4777a53c3e50-0.2.dylib | |
| extracting rust-stage0/lib/libstd-d399da1ab6f5bec0-0.2.dylib | |
| extracting rust-stage0/lib/librustc-6d90c71c9d9e629d-0.2.dylib | |
| extracting rust-stage0/lib/librustsyntax-9091617e5d566cd3-0.2.dylib | |
| extracting rust-stage0/lib/librustrt.dylib | |
| extracting rust-stage0/lib/librustllvm.dylib | |
| touch x86_64-apple-darwin/stage0/bin/rustc | |
| touch x86_64-apple-darwin/stage0/lib/librustrt.dylib | |
| touch x86_64-apple-darwin/stage0/lib/librustllvm.dylib | |
| touch x86_64-apple-darwin/stage0/lib/libcore.dylib | |
| touch x86_64-apple-darwin/stage0/lib/libstd.dylib | |
| touch x86_64-apple-darwin/stage0/lib/librustc.dylib | |
| g++ -DRUST_NDEBUG -O2 -Wall -Werror -fno-rtti -g -m64 -arch x86_64 -c -o rt/x86_64-apple-darwin/sync/timer.o -I ../src/rt -I ../src/rt/isaac -I ../src/rt/uthash -I ../src/rt/arch/x86_64 -I ../src/libuv/include ../src/rt/sync/timer.cpp | |
| g++ -DRUST_NDEBUG -O2 -Wall -Werror -fno-rtti -g -m64 -arch x86_64 -c -o rt/x86_64-apple-darwin/sync/lock_and_signal.o -I ../src/rt -I ../src/rt/isaac -I ../src/rt/uthash -I ../src/rt/arch/x86_64 -I ../src/libuv/include ../src/rt/sync/lock_and_signal.cpp | |
| g++ -DRUST_NDEBUG -O2 -Wall -Werror -fno-rtti -g -m64 -arch x86_64 -c -o rt/x86_64-apple-darwin/sync/rust_thread.o -I ../src/rt -I ../src/rt/isaac -I ../src/rt/uthash -I ../src/rt/arch/x86_64 -I ../src/libuv/include ../src/rt/sync/rust_thread.cpp | |
| g++ -DRUST_NDEBUG -O2 -Wall -Werror -fno-rtti -g -m64 -arch x86_64 -c -o rt/x86_64-apple-darwin/rust.o -I ../src/rt -I ../src/rt/isaac -I ../src/rt/uthash -I ../src/rt/arch/x86_64 -I ../src/libuv/include ../src/rt/rust.cpp | |
| g++ -DRUST_NDEBUG -O2 -Wall -Werror -fno-rtti -g -m64 -arch x86_64 -c -o rt/x86_64-apple-darwin/rust_builtin.o -I ../src/rt -I ../src/rt/isaac -I ../src/rt/uthash -I ../src/rt/arch/x86_64 -I ../src/libuv/include ../src/rt/rust_builtin.cpp | |
| g++ -DRUST_NDEBUG -O2 -Wall -Werror -fno-rtti -g -m64 -arch x86_64 -c -o rt/x86_64-apple-darwin/rust_run_program.o -I ../src/rt -I ../src/rt/isaac -I ../src/rt/uthash -I ../src/rt/arch/x86_64 -I ../src/libuv/include ../src/rt/rust_run_program.cpp | |
| g++ -DRUST_NDEBUG -O2 -Wall -Werror -fno-rtti -g -m64 -arch x86_64 -c -o rt/x86_64-apple-darwin/rust_env.o -I ../src/rt -I ../src/rt/isaac -I ../src/rt/uthash -I ../src/rt/arch/x86_64 -I ../src/libuv/include ../src/rt/rust_env.cpp | |
| g++ -DRUST_NDEBUG -O2 -Wall -Werror -fno-rtti -g -m64 -arch x86_64 -c -o rt/x86_64-apple-darwin/rust_sched_loop.o -I ../src/rt -I ../src/rt/isaac -I ../src/rt/uthash -I ../src/rt/arch/x86_64 -I ../src/libuv/include ../src/rt/rust_sched_loop.cpp | |
| g++ -DRUST_NDEBUG -O2 -Wall -Werror -fno-rtti -g -m64 -arch x86_64 -c -o rt/x86_64-apple-darwin/rust_sched_launcher.o -I ../src/rt -I ../src/rt/isaac -I ../src/rt/uthash -I ../src/rt/arch/x86_64 -I ../src/libuv/include ../src/rt/rust_sched_launcher.cpp | |
| g++ -DRUST_NDEBUG -O2 -Wall -Werror -fno-rtti -g -m64 -arch x86_64 -c -o rt/x86_64-apple-darwin/rust_sched_driver.o -I ../src/rt -I ../src/rt/isaac -I ../src/rt/uthash -I ../src/rt/arch/x86_64 -I ../src/libuv/include ../src/rt/rust_sched_driver.cpp | |
| g++ -DRUST_NDEBUG -O2 -Wall -Werror -fno-rtti -g -m64 -arch x86_64 -c -o rt/x86_64-apple-darwin/rust_scheduler.o -I ../src/rt -I ../src/rt/isaac -I ../src/rt/uthash -I ../src/rt/arch/x86_64 -I ../src/libuv/include ../src/rt/rust_scheduler.cpp | |
| g++ -DRUST_NDEBUG -O2 -Wall -Werror -fno-rtti -g -m64 -arch x86_64 -c -o rt/x86_64-apple-darwin/rust_sched_reaper.o -I ../src/rt -I ../src/rt/isaac -I ../src/rt/uthash -I ../src/rt/arch/x86_64 -I ../src/libuv/include ../src/rt/rust_sched_reaper.cpp | |
| g++ -DRUST_NDEBUG -O2 -Wall -Werror -fno-rtti -g -m64 -arch x86_64 -c -o rt/x86_64-apple-darwin/rust_task.o -I ../src/rt -I ../src/rt/isaac -I ../src/rt/uthash -I ../src/rt/arch/x86_64 -I ../src/libuv/include ../src/rt/rust_task.cpp | |
| g++ -DRUST_NDEBUG -O2 -Wall -Werror -fno-rtti -g -m64 -arch x86_64 -c -o rt/x86_64-apple-darwin/rust_stack.o -I ../src/rt -I ../src/rt/isaac -I ../src/rt/uthash -I ../src/rt/arch/x86_64 -I ../src/libuv/include ../src/rt/rust_stack.cpp | |
| g++ -DRUST_NDEBUG -O2 -Wall -Werror -fno-rtti -g -m64 -arch x86_64 -c -o rt/x86_64-apple-darwin/rust_port.o -I ../src/rt -I ../src/rt/isaac -I ../src/rt/uthash -I ../src/rt/arch/x86_64 -I ../src/libuv/include ../src/rt/rust_port.cpp | |
| g++ -DRUST_NDEBUG -O2 -Wall -Werror -fno-rtti -g -m64 -arch x86_64 -c -o rt/x86_64-apple-darwin/rust_upcall.o -I ../src/rt -I ../src/rt/isaac -I ../src/rt/uthash -I ../src/rt/arch/x86_64 -I ../src/libuv/include ../src/rt/rust_upcall.cpp | |
| g++ -DRUST_NDEBUG -O2 -Wall -Werror -fno-rtti -g -m64 -arch x86_64 -c -o rt/x86_64-apple-darwin/rust_uv.o -I ../src/rt -I ../src/rt/isaac -I ../src/rt/uthash -I ../src/rt/arch/x86_64 -I ../src/libuv/include ../src/rt/rust_uv.cpp | |
| g++ -DRUST_NDEBUG -O2 -Wall -Werror -fno-rtti -g -m64 -arch x86_64 -c -o rt/x86_64-apple-darwin/rust_log.o -I ../src/rt -I ../src/rt/isaac -I ../src/rt/uthash -I ../src/rt/arch/x86_64 -I ../src/libuv/include ../src/rt/rust_log.cpp | |
| g++ -DRUST_NDEBUG -O2 -Wall -Werror -fno-rtti -g -m64 -arch x86_64 -c -o rt/x86_64-apple-darwin/rust_port_selector.o -I ../src/rt -I ../src/rt/isaac -I ../src/rt/uthash -I ../src/rt/arch/x86_64 -I ../src/libuv/include ../src/rt/rust_port_selector.cpp | |
| g++ -DRUST_NDEBUG -O2 -Wall -Werror -fno-rtti -g -m64 -arch x86_64 -c -o rt/x86_64-apple-darwin/circular_buffer.o -I ../src/rt -I ../src/rt/isaac -I ../src/rt/uthash -I ../src/rt/arch/x86_64 -I ../src/libuv/include ../src/rt/circular_buffer.cpp | |
| g++ -DRUST_NDEBUG -O2 -Wall -Werror -fno-rtti -g -m64 -arch x86_64 -c -o rt/x86_64-apple-darwin/isaac/randport.o -I ../src/rt -I ../src/rt/isaac -I ../src/rt/uthash -I ../src/rt/arch/x86_64 -I ../src/libuv/include ../src/rt/isaac/randport.cpp | |
| g++ -DRUST_NDEBUG -O2 -Wall -Werror -fno-rtti -g -m64 -arch x86_64 -c -o rt/x86_64-apple-darwin/rust_kernel.o -I ../src/rt -I ../src/rt/isaac -I ../src/rt/uthash -I ../src/rt/arch/x86_64 -I ../src/libuv/include ../src/rt/rust_kernel.cpp | |
| g++ -DRUST_NDEBUG -O2 -Wall -Werror -fno-rtti -g -m64 -arch x86_64 -c -o rt/x86_64-apple-darwin/rust_shape.o -I ../src/rt -I ../src/rt/isaac -I ../src/rt/uthash -I ../src/rt/arch/x86_64 -I ../src/libuv/include ../src/rt/rust_shape.cpp | |
| g++ -DRUST_NDEBUG -O2 -Wall -Werror -fno-rtti -g -m64 -arch x86_64 -c -o rt/x86_64-apple-darwin/rust_abi.o -I ../src/rt -I ../src/rt/isaac -I ../src/rt/uthash -I ../src/rt/arch/x86_64 -I ../src/libuv/include ../src/rt/rust_abi.cpp | |
| g++ -DRUST_NDEBUG -O2 -Wall -Werror -fno-rtti -g -m64 -arch x86_64 -c -o rt/x86_64-apple-darwin/rust_cc.o -I ../src/rt -I ../src/rt/isaac -I ../src/rt/uthash -I ../src/rt/arch/x86_64 -I ../src/libuv/include ../src/rt/rust_cc.cpp | |
| g++ -DRUST_NDEBUG -O2 -Wall -Werror -fno-rtti -g -m64 -arch x86_64 -c -o rt/x86_64-apple-darwin/rust_debug.o -I ../src/rt -I ../src/rt/isaac -I ../src/rt/uthash -I ../src/rt/arch/x86_64 -I ../src/libuv/include ../src/rt/rust_debug.cpp | |
| g++ -DRUST_NDEBUG -O2 -Wall -Werror -fno-rtti -g -m64 -arch x86_64 -c -o rt/x86_64-apple-darwin/rust_box_annihilator.o -I ../src/rt -I ../src/rt/isaac -I ../src/rt/uthash -I ../src/rt/arch/x86_64 -I ../src/libuv/include ../src/rt/rust_box_annihilator.cpp | |
| g++ -DRUST_NDEBUG -O2 -Wall -Werror -fno-rtti -g -m64 -arch x86_64 -c -o rt/x86_64-apple-darwin/memory_region.o -I ../src/rt -I ../src/rt/isaac -I ../src/rt/uthash -I ../src/rt/arch/x86_64 -I ../src/libuv/include ../src/rt/memory_region.cpp | |
| g++ -DRUST_NDEBUG -O2 -Wall -Werror -fno-rtti -g -m64 -arch x86_64 -c -o rt/x86_64-apple-darwin/boxed_region.o -I ../src/rt -I ../src/rt/isaac -I ../src/rt/uthash -I ../src/rt/arch/x86_64 -I ../src/libuv/include ../src/rt/boxed_region.cpp | |
| g++ -DRUST_NDEBUG -O2 -Wall -Werror -fno-rtti -g -m64 -arch x86_64 -c -o rt/x86_64-apple-darwin/arch/x86_64/context.o -I ../src/rt -I ../src/rt/isaac -I ../src/rt/uthash -I ../src/rt/arch/x86_64 -I ../src/libuv/include ../src/rt/arch/x86_64/context.cpp | |
| g++ -DRUST_NDEBUG -O2 -Wall -Werror -fno-rtti -g -m64 -arch x86_64 -c -o rt/x86_64-apple-darwin/arch/x86_64/gpr.o -I ../src/rt -I ../src/rt/isaac -I ../src/rt/uthash -I ../src/rt/arch/x86_64 -I ../src/libuv/include ../src/rt/arch/x86_64/gpr.cpp | |
| cpp ../src/rt/arch/x86_64/_context.S | /Users/tchevalier/rust/build/llvm/x86_64-apple-darwin/Release+Asserts/bin/llvm-mc -assemble -filetype=obj -triple=x86_64-apple-darwin -o=rt/x86_64-apple-darwin/arch/x86_64/_context.o | |
| cpp ../src/rt/arch/x86_64/ccall.S | /Users/tchevalier/rust/build/llvm/x86_64-apple-darwin/Release+Asserts/bin/llvm-mc -assemble -filetype=obj -triple=x86_64-apple-darwin -o=rt/x86_64-apple-darwin/arch/x86_64/ccall.o | |
| cpp ../src/rt/arch/x86_64/record_sp.S | /Users/tchevalier/rust/build/llvm/x86_64-apple-darwin/Release+Asserts/bin/llvm-mc -assemble -filetype=obj -triple=x86_64-apple-darwin -o=rt/x86_64-apple-darwin/arch/x86_64/record_sp.o | |
| sed 's/^./_&/' ../src/rt/rustrt.def.in > rt/rustrt.darwin.def | |
| make -C ../mk/libuv/x86_64/mac CFLAGS="-m64 -fPIC " LDFLAGS="-m64 -fPIC" CC="gcc" CXX="g++" AR="ar" BUILDTYPE=Release builddir_name="/Users/tchevalier/rust/build//rt/x86_64-apple-darwin/libuv" V=1 FLOCK= uv | |
| gcc '-D_LARGEFILE_SOURCE' '-D_FILE_OFFSET_BITS=64' '-D_GNU_SOURCE' '-DEIO_STACKSIZE=262144' '-DHAVE_CONFIG_H' '-DEV_CONFIG_H="config_darwin.h"' '-DEIO_CONFIG_H="config_darwin.h"' '-DNDEBUG' -I../../../../src/libuv/include -I../../../../src/libuv/include/uv-private -I../../../../src/libuv/src -I../../../../src/libuv/src/unix/ev -I../../../../src/libuv/src/ares/config_darwin -Os -gdwarf-2 -fvisibility=hidden -Wnewline-eof -arch x86_64 -fno-strict-aliasing -Wall -Wendif-labels -W -Wno-unused-parameter -MMD -MF /Users/tchevalier/rust/build//rt/x86_64-apple-darwin/libuv/Release/.deps//Users/tchevalier/rust/build//rt/x86_64-apple-darwin/libuv/Release/obj.target/uv/src/libuv/src/uv-common.o.d.raw -m64 -fPIC -c -o /Users/tchevalier/rust/build//rt/x86_64-apple-darwin/libuv/Release/obj.target/uv/src/libuv/src/uv-common.o ../../../../src/libuv/src/uv-common.c | |
| gcc '-D_LARGEFILE_SOURCE' '-D_FILE_OFFSET_BITS=64' '-D_GNU_SOURCE' '-DEIO_STACKSIZE=262144' '-DHAVE_CONFIG_H' '-DEV_CONFIG_H="config_darwin.h"' '-DEIO_CONFIG_H="config_darwin.h"' '-DNDEBUG' -I../../../../src/libuv/include -I../../../../src/libuv/include/uv-private -I../../../../src/libuv/src -I../../../../src/libuv/src/unix/ev -I../../../../src/libuv/src/ares/config_darwin -Os -gdwarf-2 -fvisibility=hidden -Wnewline-eof -arch x86_64 -fno-strict-aliasing -Wall -Wendif-labels -W -Wno-unused-parameter -MMD -MF /Users/tchevalier/rust/build//rt/x86_64-apple-darwin/libuv/Release/.deps//Users/tchevalier/rust/build//rt/x86_64-apple-darwin/libuv/Release/obj.target/uv/src/libuv/src/ares/ares_cancel.o.d.raw -m64 -fPIC -c -o /Users/tchevalier/rust/build//rt/x86_64-apple-darwin/libuv/Release/obj.target/uv/src/libuv/src/ares/ares_cancel.o ../../../../src/libuv/src/ares/ares_cancel.c | |
| gcc '-D_LARGEFILE_SOURCE' '-D_FILE_OFFSET_BITS=64' '-D_GNU_SOURCE' '-DEIO_STACKSIZE=262144' '-DHAVE_CONFIG_H' '-DEV_CONFIG_H="config_darwin.h"' '-DEIO_CONFIG_H="config_darwin.h"' '-DNDEBUG' -I../../../../src/libuv/include -I../../../../src/libuv/include/uv-private -I../../../../src/libuv/src -I../../../../src/libuv/src/unix/ev -I../../../../src/libuv/src/ares/config_darwin -Os -gdwarf-2 -fvisibility=hidden -Wnewline-eof -arch x86_64 -fno-strict-aliasing -Wall -Wendif-labels -W -Wno-unused-parameter -MMD -MF /Users/tchevalier/rust/build//rt/x86_64-apple-darwin/libuv/Release/.deps//Users/tchevalier/rust/build//rt/x86_64-apple-darwin/libuv/Release/obj.target/uv/src/libuv/src/ares/ares__close_sockets.o.d.raw -m64 -fPIC -c -o /Users/tchevalier/rust/build//rt/x86_64-apple-darwin/libuv/Release/obj.target/uv/src/libuv/src/ares/ares__close_sockets.o ../../../../src/libuv/src/ares/ares__close_sockets.c | |
| gcc '-D_LARGEFILE_SOURCE' '-D_FILE_OFFSET_BITS=64' '-D_GNU_SOURCE' '-DEIO_STACKSIZE=262144' '-DHAVE_CONFIG_H' '-DEV_CONFIG_H="config_darwin.h"' '-DEIO_CONFIG_H="config_darwin.h"' '-DNDEBUG' -I../../../../src/libuv/include -I../../../../src/libuv/include/uv-private -I../../../../src/libuv/src -I../../../../src/libuv/src/unix/ev -I../../../../src/libuv/src/ares/config_darwin -Os -gdwarf-2 -fvisibility=hidden -Wnewline-eof -arch x86_64 -fno-strict-aliasing -Wall -Wendif-labels -W -Wno-unused-parameter -MMD -MF /Users/tchevalier/rust/build//rt/x86_64-apple-darwin/libuv/Release/.deps//Users/tchevalier/rust/build//rt/x86_64-apple-darwin/libuv/Release/obj.target/uv/src/libuv/src/ares/ares_data.o.d.raw -m64 -fPIC -c -o /Users/tchevalier/rust/build//rt/x86_64-apple-darwin/libuv/Release/obj.target/uv/src/libuv/src/ares/ares_data.o ../../../../src/libuv/src/ares/ares_data.c | |
| gcc '-D_LARGEFILE_SOURCE' '-D_FILE_OFFSET_BITS=64' '-D_GNU_SOURCE' '-DEIO_STACKSIZE=262144' '-DHAVE_CONFIG_H' '-DEV_CONFIG_H="config_darwin.h"' '-DEIO_CONFIG_H="config_darwin.h"' '-DNDEBUG' -I../../../../src/libuv/include -I../../../../src/libuv/include/uv-private -I../../../../src/libuv/src -I../../../../src/libuv/src/unix/ev -I../../../../src/libuv/src/ares/config_darwin -Os -gdwarf-2 -fvisibility=hidden -Wnewline-eof -arch x86_64 -fno-strict-aliasing -Wall -Wendif-labels -W -Wno-unused-parameter -MMD -MF /Users/tchevalier/rust/build//rt/x86_64-apple-darwin/libuv/Release/.deps//Users/tchevalier/rust/build//rt/x86_64-apple-darwin/libuv/Release/obj.target/uv/src/libuv/src/ares/ares_destroy.o.d.raw -m64 -fPIC -c -o /Users/tchevalier/rust/build//rt/x86_64-apple-darwin/libuv/Release/obj.target/uv/src/libuv/src/ares/ares_destroy.o ../../../../src/libuv/src/ares/ares_destroy.c | |
| gcc '-D_LARGEFILE_SOURCE' '-D_FILE_OFFSET_BITS=64' '-D_GNU_SOURCE' '-DEIO_STACKSIZE=262144' '-DHAVE_CONFIG_H' '-DEV_CONFIG_H="config_darwin.h"' '-DEIO_CONFIG_H="config_darwin.h"' '-DNDEBUG' -I../../../../src/libuv/include -I../../../../src/libuv/include/uv-private -I../../../../src/libuv/src -I../../../../src/libuv/src/unix/ev -I../../../../src/libuv/src/ares/config_darwin -Os -gdwarf-2 -fvisibility=hidden -Wnewline-eof -arch x86_64 -fno-strict-aliasing -Wall -Wendif-labels -W -Wno-unused-parameter -MMD -MF /Users/tchevalier/rust/build//rt/x86_64-apple-darwin/libuv/Release/.deps//Users/tchevalier/rust/build//rt/x86_64-apple-darwin/libuv/Release/obj.target/uv/src/libuv/src/ares/ares_expand_name.o.d.raw -m64 -fPIC -c -o /Users/tchevalier/rust/build//rt/x86_64-apple-darwin/libuv/Release/obj.target/uv/src/libuv/src/ares/ares_expand_name.o ../../../../src/libuv/src/ares/ares_expand_name.c | |
| gcc '-D_LARGEFILE_SOURCE' '-D_FILE_OFFSET_BITS=64' '-D_GNU_SOURCE' '-DEIO_STACKSIZE=262144' '-DHAVE_CONFIG_H' '-DEV_CONFIG_H="config_darwin.h"' '-DEIO_CONFIG_H="config_darwin.h"' '-DNDEBUG' -I../../../../src/libuv/include -I../../../../src/libuv/include/uv-private -I../../../../src/libuv/src -I../../../../src/libuv/src/unix/ev -I../../../../src/libuv/src/ares/config_darwin -Os -gdwarf-2 -fvisibility=hidden -Wnewline-eof -arch x86_64 -fno-strict-aliasing -Wall -Wendif-labels -W -Wno-unused-parameter -MMD -MF /Users/tchevalier/rust/build//rt/x86_64-apple-darwin/libuv/Release/.deps//Users/tchevalier/rust/build//rt/x86_64-apple-darwin/libuv/Release/obj.target/uv/src/libuv/src/ares/ares_expand_string.o.d.raw -m64 -fPIC -c -o /Users/tchevalier/rust/build//rt/x86_64-apple-darwin/libuv/Release/obj.target/uv/src/libuv/src/ares/ares_expand_string.o ../../../../src/libuv/src/ares/ares_expand_string.c | |
| gcc '-D_LARGEFILE_SOURCE' '-D_FILE_OFFSET_BITS=64' '-D_GNU_SOURCE' '-DEIO_STACKSIZE=262144' '-DHAVE_CONFIG_H' '-DEV_CONFIG_H="config_darwin.h"' '-DEIO_CONFIG_H="config_darwin.h"' '-DNDEBUG' -I../../../../src/libuv/include -I../../../../src/libuv/include/uv-private -I../../../../src/libuv/src -I../../../../src/libuv/src/unix/ev -I../../../../src/libuv/src/ares/config_darwin -Os -gdwarf-2 -fvisibility=hidden -Wnewline-eof -arch x86_64 -fno-strict-aliasing -Wall -Wendif-labels -W -Wno-unused-parameter -MMD -MF /Users/tchevalier/rust/build//rt/x86_64-apple-darwin/libuv/Release/.deps//Users/tchevalier/rust/build//rt/x86_64-apple-darwin/libuv/Release/obj.target/uv/src/libuv/src/ares/ares_fds.o.d.raw -m64 -fPIC -c -o /Users/tchevalier/rust/build//rt/x86_64-apple-darwin/libuv/Release/obj.target/uv/src/libuv/src/ares/ares_fds.o ../../../../src/libuv/src/ares/ares_fds.c | |
| gcc '-D_LARGEFILE_SOURCE' '-D_FILE_OFFSET_BITS=64' '-D_GNU_SOURCE' '-DEIO_STACKSIZE=262144' '-DHAVE_CONFIG_H' '-DEV_CONFIG_H="config_darwin.h"' '-DEIO_CONFIG_H="config_darwin.h"' '-DNDEBUG' -I../../../../src/libuv/include -I../../../../src/libuv/include/uv-private -I../../../../src/libuv/src -I../../../../src/libuv/src/unix/ev -I../../../../src/libuv/src/ares/config_darwin -Os -gdwarf-2 -fvisibility=hidden -Wnewline-eof -arch x86_64 -fno-strict-aliasing -Wall -Wendif-labels -W -Wno-unused-parameter -MMD -MF /Users/tchevalier/rust/build//rt/x86_64-apple-darwin/libuv/Release/.deps//Users/tchevalier/rust/build//rt/x86_64-apple-darwin/libuv/Release/obj.target/uv/src/libuv/src/ares/ares_free_hostent.o.d.raw -m64 -fPIC -c -o /Users/tchevalier/rust/build//rt/x86_64-apple-darwin/libuv/Release/obj.target/uv/src/libuv/src/ares/ares_free_hostent.o ../../../../src/libuv/src/ares/ares_free_hostent.c | |
| gcc '-D_LARGEFILE_SOURCE' '-D_FILE_OFFSET_BITS=64' '-D_GNU_SOURCE' '-DEIO_STACKSIZE=262144' '-DHAVE_CONFIG_H' '-DEV_CONFIG_H="config_darwin.h"' '-DEIO_CONFIG_H="config_darwin.h"' '-DNDEBUG' -I../../../../src/libuv/include -I../../../../src/libuv/include/uv-private -I../../../../src/libuv/src -I../../../../src/libuv/src/unix/ev -I../../../../src/libuv/src/ares/config_darwin -Os -gdwarf-2 -fvisibility=hidden -Wnewline-eof -arch x86_64 -fno-strict-aliasing -Wall -Wendif-labels -W -Wno-unused-parameter -MMD -MF /Users/tchevalier/rust/build//rt/x86_64-apple-darwin/libuv/Release/.deps//Users/tchevalier/rust/build//rt/x86_64-apple-darwin/libuv/Release/obj.target/uv/src/libuv/src/ares/ares_free_string.o.d.raw -m64 -fPIC -c -o /Users/tchevalier/rust/build//rt/x86_64-apple-darwin/libuv/Release/obj.target/uv/src/libuv/src/ares/ares_free_string.o ../../../../src/libuv/src/ares/ares_free_string.c | |
| gcc '-D_LARGEFILE_SOURCE' '-D_FILE_OFFSET_BITS=64' '-D_GNU_SOURCE' '-DEIO_STACKSIZE=262144' '-DHAVE_CONFIG_H' '-DEV_CONFIG_H="config_darwin.h"' '-DEIO_CONFIG_H="config_darwin.h"' '-DNDEBUG' -I../../../../src/libuv/include -I../../../../src/libuv/include/uv-private -I../../../../src/libuv/src -I../../../../src/libuv/src/unix/ev -I../../../../src/libuv/src/ares/config_darwin -Os -gdwarf-2 -fvisibility=hidden -Wnewline-eof -arch x86_64 -fno-strict-aliasing -Wall -Wendif-labels -W -Wno-unused-parameter -MMD -MF /Users/tchevalier/rust/build//rt/x86_64-apple-darwin/libuv/Release/.deps//Users/tchevalier/rust/build//rt/x86_64-apple-darwin/libuv/Release/obj.target/uv/src/libuv/src/ares/ares_gethostbyaddr.o.d.raw -m64 -fPIC -c -o /Users/tchevalier/rust/build//rt/x86_64-apple-darwin/libuv/Release/obj.target/uv/src/libuv/src/ares/ares_gethostbyaddr.o ../../../../src/libuv/src/ares/ares_gethostbyaddr.c | |
| gcc '-D_LARGEFILE_SOURCE' '-D_FILE_OFFSET_BITS=64' '-D_GNU_SOURCE' '-DEIO_STACKSIZE=262144' '-DHAVE_CONFIG_H' '-DEV_CONFIG_H="config_darwin.h"' '-DEIO_CONFIG_H="config_darwin.h"' '-DNDEBUG' -I../../../../src/libuv/include -I../../../../src/libuv/include/uv-private -I../../../../src/libuv/src -I../../../../src/libuv/src/unix/ev -I../../../../src/libuv/src/ares/config_darwin -Os -gdwarf-2 -fvisibility=hidden -Wnewline-eof -arch x86_64 -fno-strict-aliasing -Wall -Wendif-labels -W -Wno-unused-parameter -MMD -MF /Users/tchevalier/rust/build//rt/x86_64-apple-darwin/libuv/Release/.deps//Users/tchevalier/rust/build//rt/x86_64-apple-darwin/libuv/Release/obj.target/uv/src/libuv/src/ares/ares_gethostbyname.o.d.raw -m64 -fPIC -c -o /Users/tchevalier/rust/build//rt/x86_64-apple-darwin/libuv/Release/obj.target/uv/src/libuv/src/ares/ares_gethostbyname.o ../../../../src/libuv/src/ares/ares_gethostbyname.c | |
| gcc '-D_LARGEFILE_SOURCE' '-D_FILE_OFFSET_BITS=64' '-D_GNU_SOURCE' '-DEIO_STACKSIZE=262144' '-DHAVE_CONFIG_H' '-DEV_CONFIG_H="config_darwin.h"' '-DEIO_CONFIG_H="config_darwin.h"' '-DNDEBUG' -I../../../../src/libuv/include -I../../../../src/libuv/include/uv-private -I../../../../src/libuv/src -I../../../../src/libuv/src/unix/ev -I../../../../src/libuv/src/ares/config_darwin -Os -gdwarf-2 -fvisibility=hidden -Wnewline-eof -arch x86_64 -fno-strict-aliasing -Wall -Wendif-labels -W -Wno-unused-parameter -MMD -MF /Users/tchevalier/rust/build//rt/x86_64-apple-darwin/libuv/Release/.deps//Users/tchevalier/rust/build//rt/x86_64-apple-darwin/libuv/Release/obj.target/uv/src/libuv/src/ares/ares__get_hostent.o.d.raw -m64 -fPIC -c -o /Users/tchevalier/rust/build//rt/x86_64-apple-darwin/libuv/Release/obj.target/uv/src/libuv/src/ares/ares__get_hostent.o ../../../../src/libuv/src/ares/ares__get_hostent.c | |
| gcc '-D_LARGEFILE_SOURCE' '-D_FILE_OFFSET_BITS=64' '-D_GNU_SOURCE' '-DEIO_STACKSIZE=262144' '-DHAVE_CONFIG_H' '-DEV_CONFIG_H="config_darwin.h"' '-DEIO_CONFIG_H="config_darwin.h"' '-DNDEBUG' -I../../../../src/libuv/include -I../../../../src/libuv/include/uv-private -I../../../../src/libuv/src -I../../../../src/libuv/src/unix/ev -I../../../../src/libuv/src/ares/config_darwin -Os -gdwarf-2 -fvisibility=hidden -Wnewline-eof -arch x86_64 -fno-strict-aliasing -Wall -Wendif-labels -W -Wno-unused-parameter -MMD -MF /Users/tchevalier/rust/build//rt/x86_64-apple-darwin/libuv/Release/.deps//Users/tchevalier/rust/build//rt/x86_64-apple-darwin/libuv/Release/obj.target/uv/src/libuv/src/ares/ares_getnameinfo.o.d.raw -m64 -fPIC -c -o /Users/tchevalier/rust/build//rt/x86_64-apple-darwin/libuv/Release/obj.target/uv/src/libuv/src/ares/ares_getnameinfo.o ../../../../src/libuv/src/ares/ares_getnameinfo.c | |
| gcc '-D_LARGEFILE_SOURCE' '-D_FILE_OFFSET_BITS=64' '-D_GNU_SOURCE' '-DEIO_STACKSIZE=262144' '-DHAVE_CONFIG_H' '-DEV_CONFIG_H="config_darwin.h"' '-DEIO_CONFIG_H="config_darwin.h"' '-DNDEBUG' -I../../../../src/libuv/include -I../../../../src/libuv/include/uv-private -I../../../../src/libuv/src -I../../../../src/libuv/src/unix/ev -I../../../../src/libuv/src/ares/config_darwin -Os -gdwarf-2 -fvisibility=hidden -Wnewline-eof -arch x86_64 -fno-strict-aliasing -Wall -Wendif-labels -W -Wno-unused-parameter -MMD -MF /Users/tchevalier/rust/build//rt/x86_64-apple-darwin/libuv/Release/.deps//Users/tchevalier/rust/build//rt/x86_64-apple-darwin/libuv/Release/obj.target/uv/src/libuv/src/ares/ares_getopt.o.d.raw -m64 -fPIC -c -o /Users/tchevalier/rust/build//rt/x86_64-apple-darwin/libuv/Release/obj.target/uv/src/libuv/src/ares/ares_getopt.o ../../../../src/libuv/src/ares/ares_getopt.c | |
| gcc '-D_LARGEFILE_SOURCE' '-D_FILE_OFFSET_BITS=64' '-D_GNU_SOURCE' '-DEIO_STACKSIZE=262144' '-DHAVE_CONFIG_H' '-DEV_CONFIG_H="config_darwin.h"' '-DEIO_CONFIG_H="config_darwin.h"' '-DNDEBUG' -I../../../../src/libuv/include -I../../../../src/libuv/include/uv-private -I../../../../src/libuv/src -I../../../../src/libuv/src/unix/ev -I../../../../src/libuv/src/ares/config_darwin -Os -gdwarf-2 -fvisibility=hidden -Wnewline-eof -arch x86_64 -fno-strict-aliasing -Wall -Wendif-labels -W -Wno-unused-parameter -MMD -MF /Users/tchevalier/rust/build//rt/x86_64-apple-darwin/libuv/Release/.deps//Users/tchevalier/rust/build//rt/x86_64-apple-darwin/libuv/Release/obj.target/uv/src/libuv/src/ares/ares_getsock.o.d.raw -m64 -fPIC -c -o /Users/tchevalier/rust/build//rt/x86_64-apple-darwin/libuv/Release/obj.target/uv/src/libuv/src/ares/ares_getsock.o ../../../../src/libuv/src/ares/ares_getsock.c | |
| gcc '-D_LARGEFILE_SOURCE' '-D_FILE_OFFSET_BITS=64' '-D_GNU_SOURCE' '-DEIO_STACKSIZE=262144' '-DHAVE_CONFIG_H' '-DEV_CONFIG_H="config_darwin.h"' '-DEIO_CONFIG_H="config_darwin.h"' '-DNDEBUG' -I../../../../src/libuv/include -I../../../../src/libuv/include/uv-private -I../../../../src/libuv/src -I../../../../src/libuv/src/unix/ev -I../../../../src/libuv/src/ares/config_darwin -Os -gdwarf-2 -fvisibility=hidden -Wnewline-eof -arch x86_64 -fno-strict-aliasing -Wall -Wendif-labels -W -Wno-unused-parameter -MMD -MF /Users/tchevalier/rust/build//rt/x86_64-apple-darwin/libuv/Release/.deps//Users/tchevalier/rust/build//rt/x86_64-apple-darwin/libuv/Release/obj.target/uv/src/libuv/src/ares/ares_init.o.d.raw -m64 -fPIC -c -o /Users/tchevalier/rust/build//rt/x86_64-apple-darwin/libuv/Release/obj.target/uv/src/libuv/src/ares/ares_init.o ../../../../src/libuv/src/ares/ares_init.c | |
| gcc '-D_LARGEFILE_SOURCE' '-D_FILE_OFFSET_BITS=64' '-D_GNU_SOURCE' '-DEIO_STACKSIZE=262144' '-DHAVE_CONFIG_H' '-DEV_CONFIG_H="config_darwin.h"' '-DEIO_CONFIG_H="config_darwin.h"' '-DNDEBUG' -I../../../../src/libuv/include -I../../../../src/libuv/include/uv-private -I../../../../src/libuv/src -I../../../../src/libuv/src/unix/ev -I../../../../src/libuv/src/ares/config_darwin -Os -gdwarf-2 -fvisibility=hidden -Wnewline-eof -arch x86_64 -fno-strict-aliasing -Wall -Wendif-labels -W -Wno-unused-parameter -MMD -MF /Users/tchevalier/rust/build//rt/x86_64-apple-darwin/libuv/Release/.deps//Users/tchevalier/rust/build//rt/x86_64-apple-darwin/libuv/Release/obj.target/uv/src/libuv/src/ares/ares_library_init.o.d.raw -m64 -fPIC -c -o /Users/tchevalier/rust/build//rt/x86_64-apple-darwin/libuv/Release/obj.target/uv/src/libuv/src/ares/ares_library_init.o ../../../../src/libuv/src/ares/ares_library_init.c | |
| gcc '-D_LARGEFILE_SOURCE' '-D_FILE_OFFSET_BITS=64' '-D_GNU_SOURCE' '-DEIO_STACKSIZE=262144' '-DHAVE_CONFIG_H' '-DEV_CONFIG_H="config_darwin.h"' '-DEIO_CONFIG_H="config_darwin.h"' '-DNDEBUG' -I../../../../src/libuv/include -I../../../../src/libuv/include/uv-private -I../../../../src/libuv/src -I../../../../src/libuv/src/unix/ev -I../../../../src/libuv/src/ares/config_darwin -Os -gdwarf-2 -fvisibility=hidden -Wnewline-eof -arch x86_64 -fno-strict-aliasing -Wall -Wendif-labels -W -Wno-unused-parameter -MMD -MF /Users/tchevalier/rust/build//rt/x86_64-apple-darwin/libuv/Release/.deps//Users/tchevalier/rust/build//rt/x86_64-apple-darwin/libuv/Release/obj.target/uv/src/libuv/src/ares/ares_llist.o.d.raw -m64 -fPIC -c -o /Users/tchevalier/rust/build//rt/x86_64-apple-darwin/libuv/Release/obj.target/uv/src/libuv/src/ares/ares_llist.o ../../../../src/libuv/src/ares/ares_llist.c | |
| gcc '-D_LARGEFILE_SOURCE' '-D_FILE_OFFSET_BITS=64' '-D_GNU_SOURCE' '-DEIO_STACKSIZE=262144' '-DHAVE_CONFIG_H' '-DEV_CONFIG_H="config_darwin.h"' '-DEIO_CONFIG_H="config_darwin.h"' '-DNDEBUG' -I../../../../src/libuv/include -I../../../../src/libuv/include/uv-private -I../../../../src/libuv/src -I../../../../src/libuv/src/unix/ev -I../../../../src/libuv/src/ares/config_darwin -Os -gdwarf-2 -fvisibility=hidden -Wnewline-eof -arch x86_64 -fno-strict-aliasing -Wall -Wendif-labels -W -Wno-unused-parameter -MMD -MF /Users/tchevalier/rust/build//rt/x86_64-apple-darwin/libuv/Release/.deps//Users/tchevalier/rust/build//rt/x86_64-apple-darwin/libuv/Release/obj.target/uv/src/libuv/src/ares/ares_mkquery.o.d.raw -m64 -fPIC -c -o /Users/tchevalier/rust/build//rt/x86_64-apple-darwin/libuv/Release/obj.target/uv/src/libuv/src/ares/ares_mkquery.o ../../../../src/libuv/src/ares/ares_mkquery.c | |
| gcc '-D_LARGEFILE_SOURCE' '-D_FILE_OFFSET_BITS=64' '-D_GNU_SOURCE' '-DEIO_STACKSIZE=262144' '-DHAVE_CONFIG_H' '-DEV_CONFIG_H="config_darwin.h"' '-DEIO_CONFIG_H="config_darwin.h"' '-DNDEBUG' -I../../../../src/libuv/include -I../../../../src/libuv/include/uv-private -I../../../../src/libuv/src -I../../../../src/libuv/src/unix/ev -I../../../../src/libuv/src/ares/config_darwin -Os -gdwarf-2 -fvisibility=hidden -Wnewline-eof -arch x86_64 -fno-strict-aliasing -Wall -Wendif-labels -W -Wno-unused-parameter -MMD -MF /Users/tchevalier/rust/build//rt/x86_64-apple-darwin/libuv/Release/.deps//Users/tchevalier/rust/build//rt/x86_64-apple-darwin/libuv/Release/obj.target/uv/src/libuv/src/ares/ares_nowarn.o.d.raw -m64 -fPIC -c -o /Users/tchevalier/rust/build//rt/x86_64-apple-darwin/libuv/Release/obj.target/uv/src/libuv/src/ares/ares_nowarn.o ../../../../src/libuv/src/ares/ares_nowarn.c | |
| gcc '-D_LARGEFILE_SOURCE' '-D_FILE_OFFSET_BITS=64' '-D_GNU_SOURCE' '-DEIO_STACKSIZE=262144' '-DHAVE_CONFIG_H' '-DEV_CONFIG_H="config_darwin.h"' '-DEIO_CONFIG_H="config_darwin.h"' '-DNDEBUG' -I../../../../src/libuv/include -I../../../../src/libuv/include/uv-private -I../../../../src/libuv/src -I../../../../src/libuv/src/unix/ev -I../../../../src/libuv/src/ares/config_darwin -Os -gdwarf-2 -fvisibility=hidden -Wnewline-eof -arch x86_64 -fno-strict-aliasing -Wall -Wendif-labels -W -Wno-unused-parameter -MMD -MF /Users/tchevalier/rust/build//rt/x86_64-apple-darwin/libuv/Release/.deps//Users/tchevalier/rust/build//rt/x86_64-apple-darwin/libuv/Release/obj.target/uv/src/libuv/src/ares/ares_options.o.d.raw -m64 -fPIC -c -o /Users/tchevalier/rust/build//rt/x86_64-apple-darwin/libuv/Release/obj.target/uv/src/libuv/src/ares/ares_options.o ../../../../src/libuv/src/ares/ares_options.c | |
| gcc '-D_LARGEFILE_SOURCE' '-D_FILE_OFFSET_BITS=64' '-D_GNU_SOURCE' '-DEIO_STACKSIZE=262144' '-DHAVE_CONFIG_H' '-DEV_CONFIG_H="config_darwin.h"' '-DEIO_CONFIG_H="config_darwin.h"' '-DNDEBUG' -I../../../../src/libuv/include -I../../../../src/libuv/include/uv-private -I../../../../src/libuv/src -I../../../../src/libuv/src/unix/ev -I../../../../src/libuv/src/ares/config_darwin -Os -gdwarf-2 -fvisibility=hidden -Wnewline-eof -arch x86_64 -fno-strict-aliasing -Wall -Wendif-labels -W -Wno-unused-parameter -MMD -MF /Users/tchevalier/rust/build//rt/x86_64-apple-darwin/libuv/Release/.deps//Users/tchevalier/rust/build//rt/x86_64-apple-darwin/libuv/Release/obj.target/uv/src/libuv/src/ares/ares_parse_aaaa_reply.o.d.raw -m64 -fPIC -c -o /Users/tchevalier/rust/build//rt/x86_64-apple-darwin/libuv/Release/obj.target/uv/src/libuv/src/ares/ares_parse_aaaa_reply.o ../../../../src/libuv/src/ares/ares_parse_aaaa_reply.c | |
| gcc '-D_LARGEFILE_SOURCE' '-D_FILE_OFFSET_BITS=64' '-D_GNU_SOURCE' '-DEIO_STACKSIZE=262144' '-DHAVE_CONFIG_H' '-DEV_CONFIG_H="config_darwin.h"' '-DEIO_CONFIG_H="config_darwin.h"' '-DNDEBUG' -I../../../../src/libuv/include -I../../../../src/libuv/include/uv-private -I../../../../src/libuv/src -I../../../../src/libuv/src/unix/ev -I../../../../src/libuv/src/ares/config_darwin -Os -gdwarf-2 -fvisibility=hidden -Wnewline-eof -arch x86_64 -fno-strict-aliasing -Wall -Wendif-labels -W -Wno-unused-parameter -MMD -MF /Users/tchevalier/rust/build//rt/x86_64-apple-darwin/libuv/Release/.deps//Users/tchevalier/rust/build//rt/x86_64-apple-darwin/libuv/Release/obj.target/uv/src/libuv/src/ares/ares_parse_a_reply.o.d.raw -m64 -fPIC -c -o /Users/tchevalier/rust/build//rt/x86_64-apple-darwin/libuv/Release/obj.target/uv/src/libuv/src/ares/ares_parse_a_reply.o ../../../../src/libuv/src/ares/ares_parse_a_reply.c | |
| gcc '-D_LARGEFILE_SOURCE' '-D_FILE_OFFSET_BITS=64' '-D_GNU_SOURCE' '-DEIO_STACKSIZE=262144' '-DHAVE_CONFIG_H' '-DEV_CONFIG_H="config_darwin.h"' '-DEIO_CONFIG_H="config_darwin.h"' '-DNDEBUG' -I../../../../src/libuv/include -I../../../../src/libuv/include/uv-private -I../../../../src/libuv/src -I../../../../src/libuv/src/unix/ev -I../../../../src/libuv/src/ares/config_darwin -Os -gdwarf-2 -fvisibility=hidden -Wnewline-eof -arch x86_64 -fno-strict-aliasing -Wall -Wendif-labels -W -Wno-unused-parameter -MMD -MF /Users/tchevalier/rust/build//rt/x86_64-apple-darwin/libuv/Release/.deps//Users/tchevalier/rust/build//rt/x86_64-apple-darwin/libuv/Release/obj.target/uv/src/libuv/src/ares/ares_parse_mx_reply.o.d.raw -m64 -fPIC -c -o /Users/tchevalier/rust/build//rt/x86_64-apple-darwin/libuv/Release/obj.target/uv/src/libuv/src/ares/ares_parse_mx_reply.o ../../../../src/libuv/src/ares/ares_parse_mx_reply.c | |
| gcc '-D_LARGEFILE_SOURCE' '-D_FILE_OFFSET_BITS=64' '-D_GNU_SOURCE' '-DEIO_STACKSIZE=262144' '-DHAVE_CONFIG_H' '-DEV_CONFIG_H="config_darwin.h"' '-DEIO_CONFIG_H="config_darwin.h"' '-DNDEBUG' -I../../../../src/libuv/include -I../../../../src/libuv/include/uv-private -I../../../../src/libuv/src -I../../../../src/libuv/src/unix/ev -I../../../../src/libuv/src/ares/config_darwin -Os -gdwarf-2 -fvisibility=hidden -Wnewline-eof -arch x86_64 -fno-strict-aliasing -Wall -Wendif-labels -W -Wno-unused-parameter -MMD -MF /Users/tchevalier/rust/build//rt/x86_64-apple-darwin/libuv/Release/.deps//Users/tchevalier/rust/build//rt/x86_64-apple-darwin/libuv/Release/obj.target/uv/src/libuv/src/ares/ares_parse_ns_reply.o.d.raw -m64 -fPIC -c -o /Users/tchevalier/rust/build//rt/x86_64-apple-darwin/libuv/Release/obj.target/uv/src/libuv/src/ares/ares_parse_ns_reply.o ../../../../src/libuv/src/ares/ares_parse_ns_reply.c | |
| gcc '-D_LARGEFILE_SOURCE' '-D_FILE_OFFSET_BITS=64' '-D_GNU_SOURCE' '-DEIO_STACKSIZE=262144' '-DHAVE_CONFIG_H' '-DEV_CONFIG_H="config_darwin.h"' '-DEIO_CONFIG_H="config_darwin.h"' '-DNDEBUG' -I../../../../src/libuv/include -I../../../../src/libuv/include/uv-private -I../../../../src/libuv/src -I../../../../src/libuv/src/unix/ev -I../../../../src/libuv/src/ares/config_darwin -Os -gdwarf-2 -fvisibility=hidden -Wnewline-eof -arch x86_64 -fno-strict-aliasing -Wall -Wendif-labels -W -Wno-unused-parameter -MMD -MF /Users/tchevalier/rust/build//rt/x86_64-apple-darwin/libuv/Release/.deps//Users/tchevalier/rust/build//rt/x86_64-apple-darwin/libuv/Release/obj.target/uv/src/libuv/src/ares/ares_parse_ptr_reply.o.d.raw -m64 -fPIC -c -o /Users/tchevalier/rust/build//rt/x86_64-apple-darwin/libuv/Release/obj.target/uv/src/libuv/src/ares/ares_parse_ptr_reply.o ../../../../src/libuv/src/ares/ares_parse_ptr_reply.c | |
| gcc '-D_LARGEFILE_SOURCE' '-D_FILE_OFFSET_BITS=64' '-D_GNU_SOURCE' '-DEIO_STACKSIZE=262144' '-DHAVE_CONFIG_H' '-DEV_CONFIG_H="config_darwin.h"' '-DEIO_CONFIG_H="config_darwin.h"' '-DNDEBUG' -I../../../../src/libuv/include -I../../../../src/libuv/include/uv-private -I../../../../src/libuv/src -I../../../../src/libuv/src/unix/ev -I../../../../src/libuv/src/ares/config_darwin -Os -gdwarf-2 -fvisibility=hidden -Wnewline-eof -arch x86_64 -fno-strict-aliasing -Wall -Wendif-labels -W -Wno-unused-parameter -MMD -MF /Users/tchevalier/rust/build//rt/x86_64-apple-darwin/libuv/Release/.deps//Users/tchevalier/rust/build//rt/x86_64-apple-darwin/libuv/Release/obj.target/uv/src/libuv/src/ares/ares_parse_srv_reply.o.d.raw -m64 -fPIC -c -o /Users/tchevalier/rust/build//rt/x86_64-apple-darwin/libuv/Release/obj.target/uv/src/libuv/src/ares/ares_parse_srv_reply.o ../../../../src/libuv/src/ares/ares_parse_srv_reply.c | |
| gcc '-D_LARGEFILE_SOURCE' '-D_FILE_OFFSET_BITS=64' '-D_GNU_SOURCE' '-DEIO_STACKSIZE=262144' '-DHAVE_CONFIG_H' '-DEV_CONFIG_H="config_darwin.h"' '-DEIO_CONFIG_H="config_darwin.h"' '-DNDEBUG' -I../../../../src/libuv/include -I../../../../src/libuv/include/uv-private -I../../../../src/libuv/src -I../../../../src/libuv/src/unix/ev -I../../../../src/libuv/src/ares/config_darwin -Os -gdwarf-2 -fvisibility=hidden -Wnewline-eof -arch x86_64 -fno-strict-aliasing -Wall -Wendif-labels -W -Wno-unused-parameter -MMD -MF /Users/tchevalier/rust/build//rt/x86_64-apple-darwin/libuv/Release/.deps//Users/tchevalier/rust/build//rt/x86_64-apple-darwin/libuv/Release/obj.target/uv/src/libuv/src/ares/ares_parse_txt_reply.o.d.raw -m64 -fPIC -c -o /Users/tchevalier/rust/build//rt/x86_64-apple-darwin/libuv/Release/obj.target/uv/src/libuv/src/ares/ares_parse_txt_reply.o ../../../../src/libuv/src/ares/ares_parse_txt_reply.c | |
| gcc '-D_LARGEFILE_SOURCE' '-D_FILE_OFFSET_BITS=64' '-D_GNU_SOURCE' '-DEIO_STACKSIZE=262144' '-DHAVE_CONFIG_H' '-DEV_CONFIG_H="config_darwin.h"' '-DEIO_CONFIG_H="config_darwin.h"' '-DNDEBUG' -I../../../../src/libuv/include -I../../../../src/libuv/include/uv-private -I../../../../src/libuv/src -I../../../../src/libuv/src/unix/ev -I../../../../src/libuv/src/ares/config_darwin -Os -gdwarf-2 -fvisibility=hidden -Wnewline-eof -arch x86_64 -fno-strict-aliasing -Wall -Wendif-labels -W -Wno-unused-parameter -MMD -MF /Users/tchevalier/rust/build//rt/x86_64-apple-darwin/libuv/Release/.deps//Users/tchevalier/rust/build//rt/x86_64-apple-darwin/libuv/Release/obj.target/uv/src/libuv/src/ares/ares_process.o.d.raw -m64 -fPIC -c -o /Users/tchevalier/rust/build//rt/x86_64-apple-darwin/libuv/Release/obj.target/uv/src/libuv/src/ares/ares_process.o ../../../../src/libuv/src/ares/ares_process.c | |
| ../../../../src/libuv/src/ares/ares_process.c: In function ‘read_udp_packets’: | |
| ../../../../src/libuv/src/ares/ares_process.c:481: warning: pointer targets in passing argument 6 of ‘recvfrom’ differ in signedness | |
| gcc '-D_LARGEFILE_SOURCE' '-D_FILE_OFFSET_BITS=64' '-D_GNU_SOURCE' '-DEIO_STACKSIZE=262144' '-DHAVE_CONFIG_H' '-DEV_CONFIG_H="config_darwin.h"' '-DEIO_CONFIG_H="config_darwin.h"' '-DNDEBUG' -I../../../../src/libuv/include -I../../../../src/libuv/include/uv-private -I../../../../src/libuv/src -I../../../../src/libuv/src/unix/ev -I../../../../src/libuv/src/ares/config_darwin -Os -gdwarf-2 -fvisibility=hidden -Wnewline-eof -arch x86_64 -fno-strict-aliasing -Wall -Wendif-labels -W -Wno-unused-parameter -MMD -MF /Users/tchevalier/rust/build//rt/x86_64-apple-darwin/libuv/Release/.deps//Users/tchevalier/rust/build//rt/x86_64-apple-darwin/libuv/Release/obj.target/uv/src/libuv/src/ares/ares_query.o.d.raw -m64 -fPIC -c -o /Users/tchevalier/rust/build//rt/x86_64-apple-darwin/libuv/Release/obj.target/uv/src/libuv/src/ares/ares_query.o ../../../../src/libuv/src/ares/ares_query.c | |
| gcc '-D_LARGEFILE_SOURCE' '-D_FILE_OFFSET_BITS=64' '-D_GNU_SOURCE' '-DEIO_STACKSIZE=262144' '-DHAVE_CONFIG_H' '-DEV_CONFIG_H="config_darwin.h"' '-DEIO_CONFIG_H="config_darwin.h"' '-DNDEBUG' -I../../../../src/libuv/include -I../../../../src/libuv/include/uv-private -I../../../../src/libuv/src -I../../../../src/libuv/src/unix/ev -I../../../../src/libuv/src/ares/config_darwin -Os -gdwarf-2 -fvisibility=hidden -Wnewline-eof -arch x86_64 -fno-strict-aliasing -Wall -Wendif-labels -W -Wno-unused-parameter -MMD -MF /Users/tchevalier/rust/build//rt/x86_64-apple-darwin/libuv/Release/.deps//Users/tchevalier/rust/build//rt/x86_64-apple-darwin/libuv/Release/obj.target/uv/src/libuv/src/ares/ares__read_line.o.d.raw -m64 -fPIC -c -o /Users/tchevalier/rust/build//rt/x86_64-apple-darwin/libuv/Release/obj.target/uv/src/libuv/src/ares/ares__read_line.o ../../../../src/libuv/src/ares/ares__read_line.c | |
| gcc '-D_LARGEFILE_SOURCE' '-D_FILE_OFFSET_BITS=64' '-D_GNU_SOURCE' '-DEIO_STACKSIZE=262144' '-DHAVE_CONFIG_H' '-DEV_CONFIG_H="config_darwin.h"' '-DEIO_CONFIG_H="config_darwin.h"' '-DNDEBUG' -I../../../../src/libuv/include -I../../../../src/libuv/include/uv-private -I../../../../src/libuv/src -I../../../../src/libuv/src/unix/ev -I../../../../src/libuv/src/ares/config_darwin -Os -gdwarf-2 -fvisibility=hidden -Wnewline-eof -arch x86_64 -fno-strict-aliasing -Wall -Wendif-labels -W -Wno-unused-parameter -MMD -MF /Users/tchevalier/rust/build//rt/x86_64-apple-darwin/libuv/Release/.deps//Users/tchevalier/rust/build//rt/x86_64-apple-darwin/libuv/Release/obj.target/uv/src/libuv/src/ares/ares_search.o.d.raw -m64 -fPIC -c -o /Users/tchevalier/rust/build//rt/x86_64-apple-darwin/libuv/Release/obj.target/uv/src/libuv/src/ares/ares_search.o ../../../../src/libuv/src/ares/ares_search.c | |
| gcc '-D_LARGEFILE_SOURCE' '-D_FILE_OFFSET_BITS=64' '-D_GNU_SOURCE' '-DEIO_STACKSIZE=262144' '-DHAVE_CONFIG_H' '-DEV_CONFIG_H="config_darwin.h"' '-DEIO_CONFIG_H="config_darwin.h"' '-DNDEBUG' -I../../../../src/libuv/include -I../../../../src/libuv/include/uv-private -I../../../../src/libuv/src -I../../../../src/libuv/src/unix/ev -I../../../../src/libuv/src/ares/config_darwin -Os -gdwarf-2 -fvisibility=hidden -Wnewline-eof -arch x86_64 -fno-strict-aliasing -Wall -Wendif-labels -W -Wno-unused-parameter -MMD -MF /Users/tchevalier/rust/build//rt/x86_64-apple-darwin/libuv/Release/.deps//Users/tchevalier/rust/build//rt/x86_64-apple-darwin/libuv/Release/obj.target/uv/src/libuv/src/ares/ares_send.o.d.raw -m64 -fPIC -c -o /Users/tchevalier/rust/build//rt/x86_64-apple-darwin/libuv/Release/obj.target/uv/src/libuv/src/ares/ares_send.o ../../../../src/libuv/src/ares/ares_send.c | |
| gcc '-D_LARGEFILE_SOURCE' '-D_FILE_OFFSET_BITS=64' '-D_GNU_SOURCE' '-DEIO_STACKSIZE=262144' '-DHAVE_CONFIG_H' '-DEV_CONFIG_H="config_darwin.h"' '-DEIO_CONFIG_H="config_darwin.h"' '-DNDEBUG' -I../../../../src/libuv/include -I../../../../src/libuv/include/uv-private -I../../../../src/libuv/src -I../../../../src/libuv/src/unix/ev -I../../../../src/libuv/src/ares/config_darwin -Os -gdwarf-2 -fvisibility=hidden -Wnewline-eof -arch x86_64 -fno-strict-aliasing -Wall -Wendif-labels -W -Wno-unused-parameter -MMD -MF /Users/tchevalier/rust/build//rt/x86_64-apple-darwin/libuv/Release/.deps//Users/tchevalier/rust/build//rt/x86_64-apple-darwin/libuv/Release/obj.target/uv/src/libuv/src/ares/ares_strcasecmp.o.d.raw -m64 -fPIC -c -o /Users/tchevalier/rust/build//rt/x86_64-apple-darwin/libuv/Release/obj.target/uv/src/libuv/src/ares/ares_strcasecmp.o ../../../../src/libuv/src/ares/ares_strcasecmp.c | |
| gcc '-D_LARGEFILE_SOURCE' '-D_FILE_OFFSET_BITS=64' '-D_GNU_SOURCE' '-DEIO_STACKSIZE=262144' '-DHAVE_CONFIG_H' '-DEV_CONFIG_H="config_darwin.h"' '-DEIO_CONFIG_H="config_darwin.h"' '-DNDEBUG' -I../../../../src/libuv/include -I../../../../src/libuv/include/uv-private -I../../../../src/libuv/src -I../../../../src/libuv/src/unix/ev -I../../../../src/libuv/src/ares/config_darwin -Os -gdwarf-2 -fvisibility=hidden -Wnewline-eof -arch x86_64 -fno-strict-aliasing -Wall -Wendif-labels -W -Wno-unused-parameter -MMD -MF /Users/tchevalier/rust/build//rt/x86_64-apple-darwin/libuv/Release/.deps//Users/tchevalier/rust/build//rt/x86_64-apple-darwin/libuv/Release/obj.target/uv/src/libuv/src/ares/ares_strdup.o.d.raw -m64 -fPIC -c -o /Users/tchevalier/rust/build//rt/x86_64-apple-darwin/libuv/Release/obj.target/uv/src/libuv/src/ares/ares_strdup.o ../../../../src/libuv/src/ares/ares_strdup.c | |
| gcc '-D_LARGEFILE_SOURCE' '-D_FILE_OFFSET_BITS=64' '-D_GNU_SOURCE' '-DEIO_STACKSIZE=262144' '-DHAVE_CONFIG_H' '-DEV_CONFIG_H="config_darwin.h"' '-DEIO_CONFIG_H="config_darwin.h"' '-DNDEBUG' -I../../../../src/libuv/include -I../../../../src/libuv/include/uv-private -I../../../../src/libuv/src -I../../../../src/libuv/src/unix/ev -I../../../../src/libuv/src/ares/config_darwin -Os -gdwarf-2 -fvisibility=hidden -Wnewline-eof -arch x86_64 -fno-strict-aliasing -Wall -Wendif-labels -W -Wno-unused-parameter -MMD -MF /Users/tchevalier/rust/build//rt/x86_64-apple-darwin/libuv/Release/.deps//Users/tchevalier/rust/build//rt/x86_64-apple-darwin/libuv/Release/obj.target/uv/src/libuv/src/ares/ares_strerror.o.d.raw -m64 -fPIC -c -o /Users/tchevalier/rust/build//rt/x86_64-apple-darwin/libuv/Release/obj.target/uv/src/libuv/src/ares/ares_strerror.o ../../../../src/libuv/src/ares/ares_strerror.c | |
| gcc '-D_LARGEFILE_SOURCE' '-D_FILE_OFFSET_BITS=64' '-D_GNU_SOURCE' '-DEIO_STACKSIZE=262144' '-DHAVE_CONFIG_H' '-DEV_CONFIG_H="config_darwin.h"' '-DEIO_CONFIG_H="config_darwin.h"' '-DNDEBUG' -I../../../../src/libuv/include -I../../../../src/libuv/include/uv-private -I../../../../src/libuv/src -I../../../../src/libuv/src/unix/ev -I../../../../src/libuv/src/ares/config_darwin -Os -gdwarf-2 -fvisibility=hidden -Wnewline-eof -arch x86_64 -fno-strict-aliasing -Wall -Wendif-labels -W -Wno-unused-parameter -MMD -MF /Users/tchevalier/rust/build//rt/x86_64-apple-darwin/libuv/Release/.deps//Users/tchevalier/rust/build//rt/x86_64-apple-darwin/libuv/Release/obj.target/uv/src/libuv/src/ares/ares_timeout.o.d.raw -m64 -fPIC -c -o /Users/tchevalier/rust/build//rt/x86_64-apple-darwin/libuv/Release/obj.target/uv/src/libuv/src/ares/ares_timeout.o ../../../../src/libuv/src/ares/ares_timeout.c | |
| gcc '-D_LARGEFILE_SOURCE' '-D_FILE_OFFSET_BITS=64' '-D_GNU_SOURCE' '-DEIO_STACKSIZE=262144' '-DHAVE_CONFIG_H' '-DEV_CONFIG_H="config_darwin.h"' '-DEIO_CONFIG_H="config_darwin.h"' '-DNDEBUG' -I../../../../src/libuv/include -I../../../../src/libuv/include/uv-private -I../../../../src/libuv/src -I../../../../src/libuv/src/unix/ev -I../../../../src/libuv/src/ares/config_darwin -Os -gdwarf-2 -fvisibility=hidden -Wnewline-eof -arch x86_64 -fno-strict-aliasing -Wall -Wendif-labels -W -Wno-unused-parameter -MMD -MF /Users/tchevalier/rust/build//rt/x86_64-apple-darwin/libuv/Release/.deps//Users/tchevalier/rust/build//rt/x86_64-apple-darwin/libuv/Release/obj.target/uv/src/libuv/src/ares/ares__timeval.o.d.raw -m64 -fPIC -c -o /Users/tchevalier/rust/build//rt/x86_64-apple-darwin/libuv/Release/obj.target/uv/src/libuv/src/ares/ares__timeval.o ../../../../src/libuv/src/ares/ares__timeval.c | |
| gcc '-D_LARGEFILE_SOURCE' '-D_FILE_OFFSET_BITS=64' '-D_GNU_SOURCE' '-DEIO_STACKSIZE=262144' '-DHAVE_CONFIG_H' '-DEV_CONFIG_H="config_darwin.h"' '-DEIO_CONFIG_H="config_darwin.h"' '-DNDEBUG' -I../../../../src/libuv/include -I../../../../src/libuv/include/uv-private -I../../../../src/libuv/src -I../../../../src/libuv/src/unix/ev -I../../../../src/libuv/src/ares/config_darwin -Os -gdwarf-2 -fvisibility=hidden -Wnewline-eof -arch x86_64 -fno-strict-aliasing -Wall -Wendif-labels -W -Wno-unused-parameter -MMD -MF /Users/tchevalier/rust/build//rt/x86_64-apple-darwin/libuv/Release/.deps//Users/tchevalier/rust/build//rt/x86_64-apple-darwin/libuv/Release/obj.target/uv/src/libuv/src/ares/ares_version.o.d.raw -m64 -fPIC -c -o /Users/tchevalier/rust/build//rt/x86_64-apple-darwin/libuv/Release/obj.target/uv/src/libuv/src/ares/ares_version.o ../../../../src/libuv/src/ares/ares_version.c | |
| gcc '-D_LARGEFILE_SOURCE' '-D_FILE_OFFSET_BITS=64' '-D_GNU_SOURCE' '-DEIO_STACKSIZE=262144' '-DHAVE_CONFIG_H' '-DEV_CONFIG_H="config_darwin.h"' '-DEIO_CONFIG_H="config_darwin.h"' '-DNDEBUG' -I../../../../src/libuv/include -I../../../../src/libuv/include/uv-private -I../../../../src/libuv/src -I../../../../src/libuv/src/unix/ev -I../../../../src/libuv/src/ares/config_darwin -Os -gdwarf-2 -fvisibility=hidden -Wnewline-eof -arch x86_64 -fno-strict-aliasing -Wall -Wendif-labels -W -Wno-unused-parameter -MMD -MF /Users/tchevalier/rust/build//rt/x86_64-apple-darwin/libuv/Release/.deps//Users/tchevalier/rust/build//rt/x86_64-apple-darwin/libuv/Release/obj.target/uv/src/libuv/src/ares/ares_writev.o.d.raw -m64 -fPIC -c -o /Users/tchevalier/rust/build//rt/x86_64-apple-darwin/libuv/Release/obj.target/uv/src/libuv/src/ares/ares_writev.o ../../../../src/libuv/src/ares/ares_writev.c | |
| gcc '-D_LARGEFILE_SOURCE' '-D_FILE_OFFSET_BITS=64' '-D_GNU_SOURCE' '-DEIO_STACKSIZE=262144' '-DHAVE_CONFIG_H' '-DEV_CONFIG_H="config_darwin.h"' '-DEIO_CONFIG_H="config_darwin.h"' '-DNDEBUG' -I../../../../src/libuv/include -I../../../../src/libuv/include/uv-private -I../../../../src/libuv/src -I../../../../src/libuv/src/unix/ev -I../../../../src/libuv/src/ares/config_darwin -Os -gdwarf-2 -fvisibility=hidden -Wnewline-eof -arch x86_64 -fno-strict-aliasing -Wall -Wendif-labels -W -Wno-unused-parameter -MMD -MF /Users/tchevalier/rust/build//rt/x86_64-apple-darwin/libuv/Release/.deps//Users/tchevalier/rust/build//rt/x86_64-apple-darwin/libuv/Release/obj.target/uv/src/libuv/src/ares/bitncmp.o.d.raw -m64 -fPIC -c -o /Users/tchevalier/rust/build//rt/x86_64-apple-darwin/libuv/Release/obj.target/uv/src/libuv/src/ares/bitncmp.o ../../../../src/libuv/src/ares/bitncmp.c | |
| gcc '-D_LARGEFILE_SOURCE' '-D_FILE_OFFSET_BITS=64' '-D_GNU_SOURCE' '-DEIO_STACKSIZE=262144' '-DHAVE_CONFIG_H' '-DEV_CONFIG_H="config_darwin.h"' '-DEIO_CONFIG_H="config_darwin.h"' '-DNDEBUG' -I../../../../src/libuv/include -I../../../../src/libuv/include/uv-private -I../../../../src/libuv/src -I../../../../src/libuv/src/unix/ev -I../../../../src/libuv/src/ares/config_darwin -Os -gdwarf-2 -fvisibility=hidden -Wnewline-eof -arch x86_64 -fno-strict-aliasing -Wall -Wendif-labels -W -Wno-unused-parameter -MMD -MF /Users/tchevalier/rust/build//rt/x86_64-apple-darwin/libuv/Release/.deps//Users/tchevalier/rust/build//rt/x86_64-apple-darwin/libuv/Release/obj.target/uv/src/libuv/src/ares/inet_net_pton.o.d.raw -m64 -fPIC -c -o /Users/tchevalier/rust/build//rt/x86_64-apple-darwin/libuv/Release/obj.target/uv/src/libuv/src/ares/inet_net_pton.o ../../../../src/libuv/src/ares/inet_net_pton.c | |
| gcc '-D_LARGEFILE_SOURCE' '-D_FILE_OFFSET_BITS=64' '-D_GNU_SOURCE' '-DEIO_STACKSIZE=262144' '-DHAVE_CONFIG_H' '-DEV_CONFIG_H="config_darwin.h"' '-DEIO_CONFIG_H="config_darwin.h"' '-DNDEBUG' -I../../../../src/libuv/include -I../../../../src/libuv/include/uv-private -I../../../../src/libuv/src -I../../../../src/libuv/src/unix/ev -I../../../../src/libuv/src/ares/config_darwin -Os -gdwarf-2 -fvisibility=hidden -Wnewline-eof -arch x86_64 -fno-strict-aliasing -Wall -Wendif-labels -W -Wno-unused-parameter -MMD -MF /Users/tchevalier/rust/build//rt/x86_64-apple-darwin/libuv/Release/.deps//Users/tchevalier/rust/build//rt/x86_64-apple-darwin/libuv/Release/obj.target/uv/src/libuv/src/ares/inet_ntop.o.d.raw -m64 -fPIC -c -o /Users/tchevalier/rust/build//rt/x86_64-apple-darwin/libuv/Release/obj.target/uv/src/libuv/src/ares/inet_ntop.o ../../../../src/libuv/src/ares/inet_ntop.c | |
| gcc '-D_LARGEFILE_SOURCE' '-D_FILE_OFFSET_BITS=64' '-D_GNU_SOURCE' '-DEIO_STACKSIZE=262144' '-DHAVE_CONFIG_H' '-DEV_CONFIG_H="config_darwin.h"' '-DEIO_CONFIG_H="config_darwin.h"' '-DNDEBUG' -I../../../../src/libuv/include -I../../../../src/libuv/include/uv-private -I../../../../src/libuv/src -I../../../../src/libuv/src/unix/ev -I../../../../src/libuv/src/ares/config_darwin -Os -gdwarf-2 -fvisibility=hidden -Wnewline-eof -arch x86_64 -fno-strict-aliasing -Wall -Wendif-labels -W -Wno-unused-parameter -MMD -MF /Users/tchevalier/rust/build//rt/x86_64-apple-darwin/libuv/Release/.deps//Users/tchevalier/rust/build//rt/x86_64-apple-darwin/libuv/Release/obj.target/uv/src/libuv/src/ares/windows_port.o.d.raw -m64 -fPIC -c -o /Users/tchevalier/rust/build//rt/x86_64-apple-darwin/libuv/Release/obj.target/uv/src/libuv/src/ares/windows_port.o ../../../../src/libuv/src/ares/windows_port.c | |
| gcc '-D_LARGEFILE_SOURCE' '-D_FILE_OFFSET_BITS=64' '-D_GNU_SOURCE' '-DEIO_STACKSIZE=262144' '-DHAVE_CONFIG_H' '-DEV_CONFIG_H="config_darwin.h"' '-DEIO_CONFIG_H="config_darwin.h"' '-DNDEBUG' -I../../../../src/libuv/include -I../../../../src/libuv/include/uv-private -I../../../../src/libuv/src -I../../../../src/libuv/src/unix/ev -I../../../../src/libuv/src/ares/config_darwin -Os -gdwarf-2 -fvisibility=hidden -Wnewline-eof -arch x86_64 -fno-strict-aliasing -Wall -Wendif-labels -W -Wno-unused-parameter -MMD -MF /Users/tchevalier/rust/build//rt/x86_64-apple-darwin/libuv/Release/.deps//Users/tchevalier/rust/build//rt/x86_64-apple-darwin/libuv/Release/obj.target/uv/src/libuv/src/unix/core.o.d.raw -m64 -fPIC -c -o /Users/tchevalier/rust/build//rt/x86_64-apple-darwin/libuv/Release/obj.target/uv/src/libuv/src/unix/core.o ../../../../src/libuv/src/unix/core.c | |
| gcc '-D_LARGEFILE_SOURCE' '-D_FILE_OFFSET_BITS=64' '-D_GNU_SOURCE' '-DEIO_STACKSIZE=262144' '-DHAVE_CONFIG_H' '-DEV_CONFIG_H="config_darwin.h"' '-DEIO_CONFIG_H="config_darwin.h"' '-DNDEBUG' -I../../../../src/libuv/include -I../../../../src/libuv/include/uv-private -I../../../../src/libuv/src -I../../../../src/libuv/src/unix/ev -I../../../../src/libuv/src/ares/config_darwin -Os -gdwarf-2 -fvisibility=hidden -Wnewline-eof -arch x86_64 -fno-strict-aliasing -Wall -Wendif-labels -W -Wno-unused-parameter -MMD -MF /Users/tchevalier/rust/build//rt/x86_64-apple-darwin/libuv/Release/.deps//Users/tchevalier/rust/build//rt/x86_64-apple-darwin/libuv/Release/obj.target/uv/src/libuv/src/unix/uv-eio.o.d.raw -m64 -fPIC -c -o /Users/tchevalier/rust/build//rt/x86_64-apple-darwin/libuv/Release/obj.target/uv/src/libuv/src/unix/uv-eio.o ../../../../src/libuv/src/unix/uv-eio.c | |
| gcc '-D_LARGEFILE_SOURCE' '-D_FILE_OFFSET_BITS=64' '-D_GNU_SOURCE' '-DEIO_STACKSIZE=262144' '-DHAVE_CONFIG_H' '-DEV_CONFIG_H="config_darwin.h"' '-DEIO_CONFIG_H="config_darwin.h"' '-DNDEBUG' -I../../../../src/libuv/include -I../../../../src/libuv/include/uv-private -I../../../../src/libuv/src -I../../../../src/libuv/src/unix/ev -I../../../../src/libuv/src/ares/config_darwin -Os -gdwarf-2 -fvisibility=hidden -Wnewline-eof -arch x86_64 -fno-strict-aliasing -Wall -Wendif-labels -W -Wno-unused-parameter -MMD -MF /Users/tchevalier/rust/build//rt/x86_64-apple-darwin/libuv/Release/.deps//Users/tchevalier/rust/build//rt/x86_64-apple-darwin/libuv/Release/obj.target/uv/src/libuv/src/unix/fs.o.d.raw -m64 -fPIC -c -o /Users/tchevalier/rust/build//rt/x86_64-apple-darwin/libuv/Release/obj.target/uv/src/libuv/src/unix/fs.o ../../../../src/libuv/src/unix/fs.c | |
| ../../../../src/libuv/src/unix/fs.c: In function ‘uv_fs_fdatasync’: | |
| ../../../../src/libuv/src/unix/fs.c:459: warning: implicit declaration of function ‘fdatasync’ | |
| gcc '-D_LARGEFILE_SOURCE' '-D_FILE_OFFSET_BITS=64' '-D_GNU_SOURCE' '-DEIO_STACKSIZE=262144' '-DHAVE_CONFIG_H' '-DEV_CONFIG_H="config_darwin.h"' '-DEIO_CONFIG_H="config_darwin.h"' '-DNDEBUG' -I../../../../src/libuv/include -I../../../../src/libuv/include/uv-private -I../../../../src/libuv/src -I../../../../src/libuv/src/unix/ev -I../../../../src/libuv/src/ares/config_darwin -Os -gdwarf-2 -fvisibility=hidden -Wnewline-eof -arch x86_64 -fno-strict-aliasing -Wall -Wendif-labels -W -Wno-unused-parameter -MMD -MF /Users/tchevalier/rust/build//rt/x86_64-apple-darwin/libuv/Release/.deps//Users/tchevalier/rust/build//rt/x86_64-apple-darwin/libuv/Release/obj.target/uv/src/libuv/src/unix/udp.o.d.raw -m64 -fPIC -c -o /Users/tchevalier/rust/build//rt/x86_64-apple-darwin/libuv/Release/obj.target/uv/src/libuv/src/unix/udp.o ../../../../src/libuv/src/unix/udp.c | |
| gcc '-D_LARGEFILE_SOURCE' '-D_FILE_OFFSET_BITS=64' '-D_GNU_SOURCE' '-DEIO_STACKSIZE=262144' '-DHAVE_CONFIG_H' '-DEV_CONFIG_H="config_darwin.h"' '-DEIO_CONFIG_H="config_darwin.h"' '-DNDEBUG' -I../../../../src/libuv/include -I../../../../src/libuv/include/uv-private -I../../../../src/libuv/src -I../../../../src/libuv/src/unix/ev -I../../../../src/libuv/src/ares/config_darwin -Os -gdwarf-2 -fvisibility=hidden -Wnewline-eof -arch x86_64 -fno-strict-aliasing -Wall -Wendif-labels -W -Wno-unused-parameter -MMD -MF /Users/tchevalier/rust/build//rt/x86_64-apple-darwin/libuv/Release/.deps//Users/tchevalier/rust/build//rt/x86_64-apple-darwin/libuv/Release/obj.target/uv/src/libuv/src/unix/tcp.o.d.raw -m64 -fPIC -c -o /Users/tchevalier/rust/build//rt/x86_64-apple-darwin/libuv/Release/obj.target/uv/src/libuv/src/unix/tcp.o ../../../../src/libuv/src/unix/tcp.c | |
| gcc '-D_LARGEFILE_SOURCE' '-D_FILE_OFFSET_BITS=64' '-D_GNU_SOURCE' '-DEIO_STACKSIZE=262144' '-DHAVE_CONFIG_H' '-DEV_CONFIG_H="config_darwin.h"' '-DEIO_CONFIG_H="config_darwin.h"' '-DNDEBUG' -I../../../../src/libuv/include -I../../../../src/libuv/include/uv-private -I../../../../src/libuv/src -I../../../../src/libuv/src/unix/ev -I../../../../src/libuv/src/ares/config_darwin -Os -gdwarf-2 -fvisibility=hidden -Wnewline-eof -arch x86_64 -fno-strict-aliasing -Wall -Wendif-labels -W -Wno-unused-parameter -MMD -MF /Users/tchevalier/rust/build//rt/x86_64-apple-darwin/libuv/Release/.deps//Users/tchevalier/rust/build//rt/x86_64-apple-darwin/libuv/Release/obj.target/uv/src/libuv/src/unix/pipe.o.d.raw -m64 -fPIC -c -o /Users/tchevalier/rust/build//rt/x86_64-apple-darwin/libuv/Release/obj.target/uv/src/libuv/src/unix/pipe.o ../../../../src/libuv/src/unix/pipe.c | |
| gcc '-D_LARGEFILE_SOURCE' '-D_FILE_OFFSET_BITS=64' '-D_GNU_SOURCE' '-DEIO_STACKSIZE=262144' '-DHAVE_CONFIG_H' '-DEV_CONFIG_H="config_darwin.h"' '-DEIO_CONFIG_H="config_darwin.h"' '-DNDEBUG' -I../../../../src/libuv/include -I../../../../src/libuv/include/uv-private -I../../../../src/libuv/src -I../../../../src/libuv/src/unix/ev -I../../../../src/libuv/src/ares/config_darwin -Os -gdwarf-2 -fvisibility=hidden -Wnewline-eof -arch x86_64 -fno-strict-aliasing -Wall -Wendif-labels -W -Wno-unused-parameter -MMD -MF /Users/tchevalier/rust/build//rt/x86_64-apple-darwin/libuv/Release/.deps//Users/tchevalier/rust/build//rt/x86_64-apple-darwin/libuv/Release/obj.target/uv/src/libuv/src/unix/tty.o.d.raw -m64 -fPIC -c -o /Users/tchevalier/rust/build//rt/x86_64-apple-darwin/libuv/Release/obj.target/uv/src/libuv/src/unix/tty.o ../../../../src/libuv/src/unix/tty.c | |
| gcc '-D_LARGEFILE_SOURCE' '-D_FILE_OFFSET_BITS=64' '-D_GNU_SOURCE' '-DEIO_STACKSIZE=262144' '-DHAVE_CONFIG_H' '-DEV_CONFIG_H="config_darwin.h"' '-DEIO_CONFIG_H="config_darwin.h"' '-DNDEBUG' -I../../../../src/libuv/include -I../../../../src/libuv/include/uv-private -I../../../../src/libuv/src -I../../../../src/libuv/src/unix/ev -I../../../../src/libuv/src/ares/config_darwin -Os -gdwarf-2 -fvisibility=hidden -Wnewline-eof -arch x86_64 -fno-strict-aliasing -Wall -Wendif-labels -W -Wno-unused-parameter -MMD -MF /Users/tchevalier/rust/build//rt/x86_64-apple-darwin/libuv/Release/.deps//Users/tchevalier/rust/build//rt/x86_64-apple-darwin/libuv/Release/obj.target/uv/src/libuv/src/unix/stream.o.d.raw -m64 -fPIC -c -o /Users/tchevalier/rust/build//rt/x86_64-apple-darwin/libuv/Release/obj.target/uv/src/libuv/src/unix/stream.o ../../../../src/libuv/src/unix/stream.c | |
| gcc '-D_LARGEFILE_SOURCE' '-D_FILE_OFFSET_BITS=64' '-D_GNU_SOURCE' '-DEIO_STACKSIZE=262144' '-DHAVE_CONFIG_H' '-DEV_CONFIG_H="config_darwin.h"' '-DEIO_CONFIG_H="config_darwin.h"' '-DNDEBUG' -I../../../../src/libuv/include -I../../../../src/libuv/include/uv-private -I../../../../src/libuv/src -I../../../../src/libuv/src/unix/ev -I../../../../src/libuv/src/ares/config_darwin -Os -gdwarf-2 -fvisibility=hidden -Wnewline-eof -arch x86_64 -fno-strict-aliasing -Wall -Wendif-labels -W -Wno-unused-parameter -MMD -MF /Users/tchevalier/rust/build//rt/x86_64-apple-darwin/libuv/Release/.deps//Users/tchevalier/rust/build//rt/x86_64-apple-darwin/libuv/Release/obj.target/uv/src/libuv/src/unix/cares.o.d.raw -m64 -fPIC -c -o /Users/tchevalier/rust/build//rt/x86_64-apple-darwin/libuv/Release/obj.target/uv/src/libuv/src/unix/cares.o ../../../../src/libuv/src/unix/cares.c | |
| gcc '-D_LARGEFILE_SOURCE' '-D_FILE_OFFSET_BITS=64' '-D_GNU_SOURCE' '-DEIO_STACKSIZE=262144' '-DHAVE_CONFIG_H' '-DEV_CONFIG_H="config_darwin.h"' '-DEIO_CONFIG_H="config_darwin.h"' '-DNDEBUG' -I../../../../src/libuv/include -I../../../../src/libuv/include/uv-private -I../../../../src/libuv/src -I../../../../src/libuv/src/unix/ev -I../../../../src/libuv/src/ares/config_darwin -Os -gdwarf-2 -fvisibility=hidden -Wnewline-eof -arch x86_64 -fno-strict-aliasing -Wall -Wendif-labels -W -Wno-unused-parameter -MMD -MF /Users/tchevalier/rust/build//rt/x86_64-apple-darwin/libuv/Release/.deps//Users/tchevalier/rust/build//rt/x86_64-apple-darwin/libuv/Release/obj.target/uv/src/libuv/src/unix/dl.o.d.raw -m64 -fPIC -c -o /Users/tchevalier/rust/build//rt/x86_64-apple-darwin/libuv/Release/obj.target/uv/src/libuv/src/unix/dl.o ../../../../src/libuv/src/unix/dl.c | |
| gcc '-D_LARGEFILE_SOURCE' '-D_FILE_OFFSET_BITS=64' '-D_GNU_SOURCE' '-DEIO_STACKSIZE=262144' '-DHAVE_CONFIG_H' '-DEV_CONFIG_H="config_darwin.h"' '-DEIO_CONFIG_H="config_darwin.h"' '-DNDEBUG' -I../../../../src/libuv/include -I../../../../src/libuv/include/uv-private -I../../../../src/libuv/src -I../../../../src/libuv/src/unix/ev -I../../../../src/libuv/src/ares/config_darwin -Os -gdwarf-2 -fvisibility=hidden -Wnewline-eof -arch x86_64 -fno-strict-aliasing -Wall -Wendif-labels -W -Wno-unused-parameter -MMD -MF /Users/tchevalier/rust/build//rt/x86_64-apple-darwin/libuv/Release/.deps//Users/tchevalier/rust/build//rt/x86_64-apple-darwin/libuv/Release/obj.target/uv/src/libuv/src/unix/error.o.d.raw -m64 -fPIC -c -o /Users/tchevalier/rust/build//rt/x86_64-apple-darwin/libuv/Release/obj.target/uv/src/libuv/src/unix/error.o ../../../../src/libuv/src/unix/error.c | |
| gcc '-D_LARGEFILE_SOURCE' '-D_FILE_OFFSET_BITS=64' '-D_GNU_SOURCE' '-DEIO_STACKSIZE=262144' '-DHAVE_CONFIG_H' '-DEV_CONFIG_H="config_darwin.h"' '-DEIO_CONFIG_H="config_darwin.h"' '-DNDEBUG' -I../../../../src/libuv/include -I../../../../src/libuv/include/uv-private -I../../../../src/libuv/src -I../../../../src/libuv/src/unix/ev -I../../../../src/libuv/src/ares/config_darwin -Os -gdwarf-2 -fvisibility=hidden -Wnewline-eof -arch x86_64 -fno-strict-aliasing -Wall -Wendif-labels -W -Wno-unused-parameter -MMD -MF /Users/tchevalier/rust/build//rt/x86_64-apple-darwin/libuv/Release/.deps//Users/tchevalier/rust/build//rt/x86_64-apple-darwin/libuv/Release/obj.target/uv/src/libuv/src/unix/thread.o.d.raw -m64 -fPIC -c -o /Users/tchevalier/rust/build//rt/x86_64-apple-darwin/libuv/Release/obj.target/uv/src/libuv/src/unix/thread.o ../../../../src/libuv/src/unix/thread.c | |
| gcc '-D_LARGEFILE_SOURCE' '-D_FILE_OFFSET_BITS=64' '-D_GNU_SOURCE' '-DEIO_STACKSIZE=262144' '-DHAVE_CONFIG_H' '-DEV_CONFIG_H="config_darwin.h"' '-DEIO_CONFIG_H="config_darwin.h"' '-DNDEBUG' -I../../../../src/libuv/include -I../../../../src/libuv/include/uv-private -I../../../../src/libuv/src -I../../../../src/libuv/src/unix/ev -I../../../../src/libuv/src/ares/config_darwin -Os -gdwarf-2 -fvisibility=hidden -Wnewline-eof -arch x86_64 -fno-strict-aliasing -Wall -Wendif-labels -W -Wno-unused-parameter -MMD -MF /Users/tchevalier/rust/build//rt/x86_64-apple-darwin/libuv/Release/.deps//Users/tchevalier/rust/build//rt/x86_64-apple-darwin/libuv/Release/obj.target/uv/src/libuv/src/unix/process.o.d.raw -m64 -fPIC -c -o /Users/tchevalier/rust/build//rt/x86_64-apple-darwin/libuv/Release/obj.target/uv/src/libuv/src/unix/process.o ../../../../src/libuv/src/unix/process.c | |
| gcc '-D_LARGEFILE_SOURCE' '-D_FILE_OFFSET_BITS=64' '-D_GNU_SOURCE' '-DEIO_STACKSIZE=262144' '-DHAVE_CONFIG_H' '-DEV_CONFIG_H="config_darwin.h"' '-DEIO_CONFIG_H="config_darwin.h"' '-DNDEBUG' -I../../../../src/libuv/include -I../../../../src/libuv/include/uv-private -I../../../../src/libuv/src -I../../../../src/libuv/src/unix/ev -I../../../../src/libuv/src/ares/config_darwin -Os -gdwarf-2 -fvisibility=hidden -Wnewline-eof -arch x86_64 -fno-strict-aliasing -Wall -Wendif-labels -W -Wno-unused-parameter -MMD -MF /Users/tchevalier/rust/build//rt/x86_64-apple-darwin/libuv/Release/.deps//Users/tchevalier/rust/build//rt/x86_64-apple-darwin/libuv/Release/obj.target/uv/src/libuv/src/unix/eio/eio.o.d.raw -m64 -fPIC -c -o /Users/tchevalier/rust/build//rt/x86_64-apple-darwin/libuv/Release/obj.target/uv/src/libuv/src/unix/eio/eio.o ../../../../src/libuv/src/unix/eio/eio.c | |
| ../../../../src/libuv/src/unix/eio/eio.c: In function ‘etp_poll’: | |
| ../../../../src/libuv/src/unix/eio/eio.c:710: warning: comparison between signed and unsigned | |
| ../../../../src/libuv/src/unix/eio/eio.c: In function ‘grp_try_feed’: | |
| ../../../../src/libuv/src/unix/eio/eio.c:818: warning: comparison between signed and unsigned | |
| ../../../../src/libuv/src/unix/eio/eio.c: In function ‘eio__sync_file_range’: | |
| ../../../../src/libuv/src/unix/eio/eio.c:1096: warning: implicit declaration of function ‘fdatasync’ | |
| ../../../../src/libuv/src/unix/eio/eio.c: In function ‘eio__mtouch’: | |
| ../../../../src/libuv/src/unix/eio/eio.c:1400: warning: comparison between signed and unsigned | |
| ../../../../src/libuv/src/unix/eio/eio.c:1402: warning: comparison between signed and unsigned | |
| ../../../../src/libuv/src/unix/eio/eio.c:1398: warning: suggest explicit braces to avoid ambiguous ‘else’ | |
| ../../../../src/libuv/src/unix/eio/eio.c: In function ‘eio__realpath’: | |
| ../../../../src/libuv/src/unix/eio/eio.c:1567: warning: label ‘done’ defined but not used | |
| ../../../../src/libuv/src/unix/eio/eio.c: In function ‘eio_dent_radix_sort’: | |
| ../../../../src/libuv/src/unix/eio/eio.c:1608: warning: comparison between signed and unsigned | |
| ../../../../src/libuv/src/unix/eio/eio.c:1613: warning: comparison between signed and unsigned | |
| ../../../../src/libuv/src/unix/eio/eio.c: In function ‘eio__scandir’: | |
| ../../../../src/libuv/src/unix/eio/eio.c:1846: warning: suggest explicit braces to avoid ambiguous ‘else’ | |
| ../../../../src/libuv/src/unix/eio/eio.c: In function ‘eio_execute’: | |
| ../../../../src/libuv/src/unix/eio/eio.c:2205: warning: implicit declaration of function ‘rename’ | |
| ../../../../src/libuv/src/unix/eio/eio.c: At top level: | |
| ../../../../src/libuv/src/unix/eio/ecb.h:110: warning: ‘ecb_mf_lock’ defined but not used | |
| ../../../../src/libuv/src/unix/eio/ecb.h:229: warning: ‘ecb_ctz64’ defined but not used | |
| ../../../../src/libuv/src/unix/eio/ecb.h:265: warning: ‘ecb_ld64’ defined but not used | |
| ../../../../src/libuv/src/unix/eio/ecb.h:279: warning: ‘ecb_popcount64’ defined but not used | |
| ../../../../src/libuv/src/unix/eio/ecb.h:292: warning: ‘ecb_rotl8’ defined but not used | |
| ../../../../src/libuv/src/unix/eio/ecb.h:293: warning: ‘ecb_rotr8’ defined but not used | |
| ../../../../src/libuv/src/unix/eio/ecb.h:295: warning: ‘ecb_rotr16’ defined but not used | |
| ../../../../src/libuv/src/unix/eio/ecb.h:296: warning: ‘ecb_rotl32’ defined but not used | |
| ../../../../src/libuv/src/unix/eio/ecb.h:297: warning: ‘ecb_rotr32’ defined but not used | |
| ../../../../src/libuv/src/unix/eio/ecb.h:298: warning: ‘ecb_rotl64’ defined but not used | |
| ../../../../src/libuv/src/unix/eio/ecb.h:299: warning: ‘ecb_rotr64’ defined but not used | |
| ../../../../src/libuv/src/unix/eio/ecb.h:323: warning: ‘ecb_bswap64’ defined but not used | |
| ../../../../src/libuv/src/unix/eio/ecb.h:333: warning: ‘ecb_unreachable’ defined but not used | |
| ../../../../src/libuv/src/unix/eio/ecb.h:348: warning: ‘ecb_big_endian’ defined but not used | |
| ../../../../src/libuv/src/unix/eio/ecb.h:350: warning: ‘ecb_little_endian’ defined but not used | |
| gcc '-D_LARGEFILE_SOURCE' '-D_FILE_OFFSET_BITS=64' '-D_GNU_SOURCE' '-DEIO_STACKSIZE=262144' '-DHAVE_CONFIG_H' '-DEV_CONFIG_H="config_darwin.h"' '-DEIO_CONFIG_H="config_darwin.h"' '-DNDEBUG' -I../../../../src/libuv/include -I../../../../src/libuv/include/uv-private -I../../../../src/libuv/src -I../../../../src/libuv/src/unix/ev -I../../../../src/libuv/src/ares/config_darwin -Os -gdwarf-2 -fvisibility=hidden -Wnewline-eof -arch x86_64 -fno-strict-aliasing -Wall -Wendif-labels -W -Wno-unused-parameter -MMD -MF /Users/tchevalier/rust/build//rt/x86_64-apple-darwin/libuv/Release/.deps//Users/tchevalier/rust/build//rt/x86_64-apple-darwin/libuv/Release/obj.target/uv/src/libuv/src/unix/ev/ev.o.d.raw -m64 -fPIC -c -o /Users/tchevalier/rust/build//rt/x86_64-apple-darwin/libuv/Release/obj.target/uv/src/libuv/src/unix/ev/ev.o ../../../../src/libuv/src/unix/ev/ev.c | |
| ../../../../src/libuv/src/unix/ev/ev.c: In function ‘array_nextsize’: | |
| ../../../../src/libuv/src/unix/ev/ev.c:845: warning: comparison between signed and unsigned | |
| ../../../../src/libuv/src/unix/ev/ev.c: In function ‘ev_feed_event’: | |
| ../../../../src/libuv/src/unix/ev/ev.c:907: warning: unused variable ‘ocur_’ | |
| ../../../../src/libuv/src/unix/ev/ev.c: In function ‘feed_reverse’: | |
| ../../../../src/libuv/src/unix/ev/ev.c:916: warning: unused variable ‘ocur_’ | |
| ../../../../src/libuv/src/unix/ev/ev.c: In function ‘fd_change’: | |
| ../../../../src/libuv/src/unix/ev/ev.c:1043: warning: unused variable ‘ocur_’ | |
| In file included from ../../../../src/libuv/src/unix/ev/ev.c:1538: | |
| ../../../../src/libuv/src/unix/ev/ev_kqueue.c: At top level: | |
| ../../../../src/libuv/src/unix/ev/ev_kqueue.c:49: warning: ‘static’ is not at beginning of declaration | |
| ../../../../src/libuv/src/unix/ev/ev_kqueue.c:49: warning: ‘inline’ is not at beginning of declaration | |
| ../../../../src/libuv/src/unix/ev/ev_kqueue.c: In function ‘kqueue_change’: | |
| ../../../../src/libuv/src/unix/ev/ev_kqueue.c:53: warning: unused variable ‘ocur_’ | |
| ../../../../src/libuv/src/unix/ev/ev_kqueue.c: At top level: | |
| ../../../../src/libuv/src/unix/ev/ev_kqueue.c:170: warning: ‘static’ is not at beginning of declaration | |
| ../../../../src/libuv/src/unix/ev/ev_kqueue.c:170: warning: ‘inline’ is not at beginning of declaration | |
| ../../../../src/libuv/src/unix/ev/ev_kqueue.c:193: warning: ‘static’ is not at beginning of declaration | |
| ../../../../src/libuv/src/unix/ev/ev_kqueue.c:193: warning: ‘inline’ is not at beginning of declaration | |
| ../../../../src/libuv/src/unix/ev/ev_kqueue.c:200: warning: ‘static’ is not at beginning of declaration | |
| ../../../../src/libuv/src/unix/ev/ev_kqueue.c:200: warning: ‘inline’ is not at beginning of declaration | |
| In file included from ../../../../src/libuv/src/unix/ev/ev.c:1544: | |
| ../../../../src/libuv/src/unix/ev/ev_poll.c:42: warning: ‘static’ is not at beginning of declaration | |
| ../../../../src/libuv/src/unix/ev/ev_poll.c:42: warning: ‘inline’ is not at beginning of declaration | |
| ../../../../src/libuv/src/unix/ev/ev_poll.c: In function ‘poll_modify’: | |
| ../../../../src/libuv/src/unix/ev/ev_poll.c:66: warning: unused variable ‘ocur_’ | |
| ../../../../src/libuv/src/unix/ev/ev_poll.c: At top level: | |
| ../../../../src/libuv/src/unix/ev/ev_poll.c:129: warning: ‘static’ is not at beginning of declaration | |
| ../../../../src/libuv/src/unix/ev/ev_poll.c:129: warning: ‘inline’ is not at beginning of declaration | |
| ../../../../src/libuv/src/unix/ev/ev_poll.c:142: warning: ‘static’ is not at beginning of declaration | |
| ../../../../src/libuv/src/unix/ev/ev_poll.c:142: warning: ‘inline’ is not at beginning of declaration | |
| In file included from ../../../../src/libuv/src/unix/ev/ev.c:1547: | |
| ../../../../src/libuv/src/unix/ev/ev_select.c:269: warning: ‘static’ is not at beginning of declaration | |
| ../../../../src/libuv/src/unix/ev/ev_select.c:269: warning: ‘inline’ is not at beginning of declaration | |
| ../../../../src/libuv/src/unix/ev/ev_select.c:298: warning: ‘static’ is not at beginning of declaration | |
| ../../../../src/libuv/src/unix/ev/ev_select.c:298: warning: ‘inline’ is not at beginning of declaration | |
| ../../../../src/libuv/src/unix/ev/ev.c:1563: warning: ‘static’ is not at beginning of declaration | |
| ../../../../src/libuv/src/unix/ev/ev.c:1563: warning: ‘inline’ is not at beginning of declaration | |
| ../../../../src/libuv/src/unix/ev/ev.c: In function ‘periodics_reify’: | |
| ../../../../src/libuv/src/unix/ev/ev.c:2235: warning: unused variable ‘feed_count’ | |
| ../../../../src/libuv/src/unix/ev/ev.c: In function ‘ev_io_start’: | |
| ../../../../src/libuv/src/unix/ev/ev.c:2681: warning: suggest parentheses around arithmetic in operand of | | |
| ../../../../src/libuv/src/unix/ev/ev.c: In function ‘ev_timer_start’: | |
| ../../../../src/libuv/src/unix/ev/ev.c:2720: warning: unused variable ‘ocur_’ | |
| ../../../../src/libuv/src/unix/ev/ev.c: In function ‘ev_periodic_start’: | |
| ../../../../src/libuv/src/unix/ev/ev.c:2812: warning: unused variable ‘ocur_’ | |
| ../../../../src/libuv/src/unix/ev/ev.c: In function ‘ev_idle_start’: | |
| ../../../../src/libuv/src/unix/ev/ev.c:3388: warning: unused variable ‘ocur_’ | |
| ../../../../src/libuv/src/unix/ev/ev.c: In function ‘ev_prepare_start’: | |
| ../../../../src/libuv/src/unix/ev/ev.c:3428: warning: unused variable ‘ocur_’ | |
| ../../../../src/libuv/src/unix/ev/ev.c: In function ‘ev_check_start’: | |
| ../../../../src/libuv/src/unix/ev/ev.c:3466: warning: unused variable ‘ocur_’ | |
| ../../../../src/libuv/src/unix/ev/ev.c: In function ‘ev_fork_start’: | |
| ../../../../src/libuv/src/unix/ev/ev.c:3613: warning: unused variable ‘ocur_’ | |
| ../../../../src/libuv/src/unix/ev/ev.c: In function ‘ev_cleanup_start’: | |
| ../../../../src/libuv/src/unix/ev/ev.c:3651: warning: unused variable ‘ocur_’ | |
| ../../../../src/libuv/src/unix/ev/ev.c: In function ‘ev_async_start’: | |
| ../../../../src/libuv/src/unix/ev/ev.c:3696: warning: unused variable ‘ocur_’ | |
| ../../../../src/libuv/src/unix/ev/ev.c:3910:27: warning: "/*" within comment | |
| ../../../../src/libuv/src/unix/ev/ev.c:3911:27: warning: "/*" within comment | |
| gcc '-D_LARGEFILE_SOURCE' '-D_FILE_OFFSET_BITS=64' '-D_GNU_SOURCE' '-DEIO_STACKSIZE=262144' '-DHAVE_CONFIG_H' '-DEV_CONFIG_H="config_darwin.h"' '-DEIO_CONFIG_H="config_darwin.h"' '-DNDEBUG' -I../../../../src/libuv/include -I../../../../src/libuv/include/uv-private -I../../../../src/libuv/src -I../../../../src/libuv/src/unix/ev -I../../../../src/libuv/src/ares/config_darwin -Os -gdwarf-2 -fvisibility=hidden -Wnewline-eof -arch x86_64 -fno-strict-aliasing -Wall -Wendif-labels -W -Wno-unused-parameter -MMD -MF /Users/tchevalier/rust/build//rt/x86_64-apple-darwin/libuv/Release/.deps//Users/tchevalier/rust/build//rt/x86_64-apple-darwin/libuv/Release/obj.target/uv/src/libuv/src/unix/darwin.o.d.raw -m64 -fPIC -c -o /Users/tchevalier/rust/build//rt/x86_64-apple-darwin/libuv/Release/obj.target/uv/src/libuv/src/unix/darwin.o ../../../../src/libuv/src/unix/darwin.c | |
| In file included from /System/Library/Frameworks/CoreServices.framework/Frameworks/SearchKit.framework/Headers/SearchKit.h:30, | |
| from /System/Library/Frameworks/CoreServices.framework/Headers/CoreServices.h:45, | |
| from ../../../../src/libuv/src/unix/darwin.c:34: | |
| /System/Library/Frameworks/CoreServices.framework/Frameworks/SearchKit.framework/Headers/SKDocument.h:51: error: expected ‘=’, ‘,’, ‘;’, ‘asm’ or ‘__attribute__’ before ‘SKDocumentRef’ | |
| /System/Library/Frameworks/CoreServices.framework/Frameworks/SearchKit.framework/Headers/SKDocument.h:67: error: expected ‘=’, ‘,’, ‘;’, ‘asm’ or ‘__attribute__’ before ‘SKDocumentGetTypeID’ | |
| /System/Library/Frameworks/CoreServices.framework/Frameworks/SearchKit.framework/Headers/SKDocument.h:98: error: expected ‘=’, ‘,’, ‘;’, ‘asm’ or ‘__attribute__’ before ‘SKDocumentCreateWithURL’ | |
| /System/Library/Frameworks/CoreServices.framework/Frameworks/SearchKit.framework/Headers/SKDocument.h:116: error: expected ‘=’, ‘,’, ‘;’, ‘asm’ or ‘__attribute__’ before ‘SKDocumentCopyURL’ | |
| /System/Library/Frameworks/CoreServices.framework/Frameworks/SearchKit.framework/Headers/SKDocument.h:157: error: expected ‘=’, ‘,’, ‘;’, ‘asm’ or ‘__attribute__’ before ‘SKDocumentCreate’ | |
| /System/Library/Frameworks/CoreServices.framework/Frameworks/SearchKit.framework/Headers/SKDocument.h:183: error: expected ‘=’, ‘,’, ‘;’, ‘asm’ or ‘__attribute__’ before ‘SKDocumentGetSchemeName’ | |
| /System/Library/Frameworks/CoreServices.framework/Frameworks/SearchKit.framework/Headers/SKDocument.h:206: error: expected ‘=’, ‘,’, ‘;’, ‘asm’ or ‘__attribute__’ before ‘SKDocumentGetName’ | |
| /System/Library/Frameworks/CoreServices.framework/Frameworks/SearchKit.framework/Headers/SKDocument.h:230: error: expected ‘=’, ‘,’, ‘;’, ‘asm’ or ‘__attribute__’ before ‘SKDocumentGetParent’ | |
| In file included from /System/Library/Frameworks/CoreServices.framework/Frameworks/SearchKit.framework/Headers/SearchKit.h:34, | |
| from /System/Library/Frameworks/CoreServices.framework/Headers/CoreServices.h:45, | |
| from ../../../../src/libuv/src/unix/darwin.c:34: | |
| /System/Library/Frameworks/CoreServices.framework/Frameworks/SearchKit.framework/Headers/SKAnalysis.h:54: error: expected ‘=’, ‘,’, ‘;’, ‘asm’ or ‘__attribute__’ before ‘kSKMinTermLength’ | |
| /System/Library/Frameworks/CoreServices.framework/Frameworks/SearchKit.framework/Headers/SKAnalysis.h:71: error: expected ‘=’, ‘,’, ‘;’, ‘asm’ or ‘__attribute__’ before ‘kSKSubstitutions’ | |
| /System/Library/Frameworks/CoreServices.framework/Frameworks/SearchKit.framework/Headers/SKAnalysis.h:88: error: expected ‘=’, ‘,’, ‘;’, ‘asm’ or ‘__attribute__’ before ‘kSKStopWords’ | |
| /System/Library/Frameworks/CoreServices.framework/Frameworks/SearchKit.framework/Headers/SKAnalysis.h:107: error: expected ‘=’, ‘,’, ‘;’, ‘asm’ or ‘__attribute__’ before ‘kSKProximityIndexing’ | |
| /System/Library/Frameworks/CoreServices.framework/Frameworks/SearchKit.framework/Headers/SKAnalysis.h:127: error: expected ‘=’, ‘,’, ‘;’, ‘asm’ or ‘__attribute__’ before ‘kSKMaximumTerms’ | |
| /System/Library/Frameworks/CoreServices.framework/Frameworks/SearchKit.framework/Headers/SKAnalysis.h:146: error: expected ‘=’, ‘,’, ‘;’, ‘asm’ or ‘__attribute__’ before ‘kSKTermChars’ | |
| /System/Library/Frameworks/CoreServices.framework/Frameworks/SearchKit.framework/Headers/SKAnalysis.h:165: error: expected ‘=’, ‘,’, ‘;’, ‘asm’ or ‘__attribute__’ before ‘kSKStartTermChars’ | |
| /System/Library/Frameworks/CoreServices.framework/Frameworks/SearchKit.framework/Headers/SKAnalysis.h:184: error: expected ‘=’, ‘,’, ‘;’, ‘asm’ or ‘__attribute__’ before ‘kSKEndTermChars’ | |
| /System/Library/Frameworks/CoreServices.framework/Frameworks/SearchKit.framework/Headers/SKAnalysis.h:207: error: expected ‘=’, ‘,’, ‘;’, ‘asm’ or ‘__attribute__’ before ‘kSKLanguageTypes’ | |
| In file included from /System/Library/Frameworks/CoreServices.framework/Frameworks/SearchKit.framework/Headers/SearchKit.h:38, | |
| from /System/Library/Frameworks/CoreServices.framework/Headers/CoreServices.h:45, | |
| from ../../../../src/libuv/src/unix/darwin.c:34: | |
| /System/Library/Frameworks/CoreServices.framework/Frameworks/SearchKit.framework/Headers/SKIndex.h:75: error: expected ‘=’, ‘,’, ‘;’, ‘asm’ or ‘__attribute__’ before ‘SKIndexGetTypeID’ | |
| /System/Library/Frameworks/CoreServices.framework/Frameworks/SearchKit.framework/Headers/SKIndex.h:99: error: expected ‘=’, ‘,’, ‘;’, ‘asm’ or ‘__attribute__’ before ‘SKIndexDocumentIteratorGetTypeID’ | |
| /System/Library/Frameworks/CoreServices.framework/Frameworks/SearchKit.framework/Headers/SKIndex.h:215: error: expected ‘)’ before ‘inURL’ | |
| /System/Library/Frameworks/CoreServices.framework/Frameworks/SearchKit.framework/Headers/SKIndex.h:256: error: expected ‘)’ before ‘inURL’ | |
| /System/Library/Frameworks/CoreServices.framework/Frameworks/SearchKit.framework/Headers/SKIndex.h:295: error: expected ‘)’ before ‘inData’ | |
| /System/Library/Frameworks/CoreServices.framework/Frameworks/SearchKit.framework/Headers/SKIndex.h:332: error: expected ‘)’ before ‘inData’ | |
| /System/Library/Frameworks/CoreServices.framework/Frameworks/SearchKit.framework/Headers/SKIndex.h:368: error: expected ‘)’ before ‘inData’ | |
| /System/Library/Frameworks/CoreServices.framework/Frameworks/SearchKit.framework/Headers/SKIndex.h:394: error: expected ‘=’, ‘,’, ‘;’, ‘asm’ or ‘__attribute__’ before ‘SKIndexFlush’ | |
| /System/Library/Frameworks/CoreServices.framework/Frameworks/SearchKit.framework/Headers/SKIndex.h:411: error: expected declaration specifiers or ‘...’ before ‘CFIndex’ | |
| /System/Library/Frameworks/CoreServices.framework/Frameworks/SearchKit.framework/Headers/SKIndex.h:430: error: expected ‘=’, ‘,’, ‘;’, ‘asm’ or ‘__attribute__’ before ‘SKIndexGetMaximumBytesBeforeFlush’ | |
| /System/Library/Frameworks/CoreServices.framework/Frameworks/SearchKit.framework/Headers/SKIndex.h:456: error: expected ‘=’, ‘,’, ‘;’, ‘asm’ or ‘__attribute__’ before ‘SKIndexCompact’ | |
| /System/Library/Frameworks/CoreServices.framework/Frameworks/SearchKit.framework/Headers/SKIndex.h:498: error: expected ‘=’, ‘,’, ‘;’, ‘asm’ or ‘__attribute__’ before ‘SKIndexGetAnalysisProperties’ | |
| /System/Library/Frameworks/CoreServices.framework/Frameworks/SearchKit.framework/Headers/SKIndex.h:522: error: expected ‘=’, ‘,’, ‘;’, ‘asm’ or ‘__attribute__’ before ‘SKIndexGetDocumentCount’ | |
| /System/Library/Frameworks/CoreServices.framework/Frameworks/SearchKit.framework/Headers/SKIndex.h:543: error: expected ‘=’, ‘,’, ‘;’, ‘asm’ or ‘__attribute__’ before ‘SKDocumentID’ | |
| /System/Library/Frameworks/CoreServices.framework/Frameworks/SearchKit.framework/Headers/SKIndex.h:575: error: expected ‘=’, ‘,’, ‘;’, ‘asm’ or ‘__attribute__’ before ‘SKIndexAddDocumentWithText’ | |
| /System/Library/Frameworks/CoreServices.framework/Frameworks/SearchKit.framework/Headers/SKIndex.h:624: error: expected ‘=’, ‘,’, ‘;’, ‘asm’ or ‘__attribute__’ before ‘SKIndexAddDocument’ | |
| /System/Library/Frameworks/CoreServices.framework/Frameworks/SearchKit.framework/Headers/SKIndex.h:656: error: expected ‘=’, ‘,’, ‘;’, ‘asm’ or ‘__attribute__’ before ‘SKIndexRemoveDocument’ | |
| /System/Library/Frameworks/CoreServices.framework/Frameworks/SearchKit.framework/Headers/SKIndex.h:677: error: expected ‘=’, ‘,’, ‘;’, ‘asm’ or ‘__attribute__’ before ‘SKIndexCopyDocumentProperties’ | |
| /System/Library/Frameworks/CoreServices.framework/Frameworks/SearchKit.framework/Headers/SKIndex.h:698: error: expected declaration specifiers or ‘...’ before ‘SKDocumentRef’ | |
| /System/Library/Frameworks/CoreServices.framework/Frameworks/SearchKit.framework/Headers/SKIndex.h:699: error: expected declaration specifiers or ‘...’ before ‘CFDictionaryRef’ | |
| /System/Library/Frameworks/CoreServices.framework/Frameworks/SearchKit.framework/Headers/SKIndex.h:723: error: expected declaration specifiers or ‘...’ before ‘SKDocumentRef’ | |
| /System/Library/Frameworks/CoreServices.framework/Frameworks/SearchKit.framework/Headers/SKIndex.h:742: error: expected ‘=’, ‘,’, ‘;’, ‘asm’ or ‘__attribute__’ before ‘SKIndexGetDocumentID’ | |
| /System/Library/Frameworks/CoreServices.framework/Frameworks/SearchKit.framework/Headers/SKIndex.h:759: error: expected ‘=’, ‘,’, ‘;’, ‘asm’ or ‘__attribute__’ before ‘SKIndexCopyDocumentForDocumentID’ | |
| /System/Library/Frameworks/CoreServices.framework/Frameworks/SearchKit.framework/Headers/SKIndex.h:776: error: expected ‘=’, ‘,’, ‘;’, ‘asm’ or ‘__attribute__’ before ‘SKIndexRenameDocument’ | |
| /System/Library/Frameworks/CoreServices.framework/Frameworks/SearchKit.framework/Headers/SKIndex.h:794: error: expected ‘=’, ‘,’, ‘;’, ‘asm’ or ‘__attribute__’ before ‘SKIndexMoveDocument’ | |
| /System/Library/Frameworks/CoreServices.framework/Frameworks/SearchKit.framework/Headers/SKIndex.h:815: error: expected declaration specifiers or ‘...’ before ‘SKDocumentRef’ | |
| /System/Library/Frameworks/CoreServices.framework/Frameworks/SearchKit.framework/Headers/SKIndex.h:835: error: expected ‘=’, ‘,’, ‘;’, ‘asm’ or ‘__attribute__’ before ‘SKIndexDocumentIteratorCopyNext’ | |
| /System/Library/Frameworks/CoreServices.framework/Frameworks/SearchKit.framework/Headers/SKIndex.h:853: error: expected ‘=’, ‘,’, ‘;’, ‘asm’ or ‘__attribute__’ before ‘SKIndexGetMaximumDocumentID’ | |
| /System/Library/Frameworks/CoreServices.framework/Frameworks/SearchKit.framework/Headers/SKIndex.h:868: error: expected ‘=’, ‘,’, ‘;’, ‘asm’ or ‘__attribute__’ before ‘SKIndexGetDocumentTermCount’ | |
| /System/Library/Frameworks/CoreServices.framework/Frameworks/SearchKit.framework/Headers/SKIndex.h:888: error: expected ‘=’, ‘,’, ‘;’, ‘asm’ or ‘__attribute__’ before ‘SKIndexCopyTermIDArrayForDocumentID’ | |
| /System/Library/Frameworks/CoreServices.framework/Frameworks/SearchKit.framework/Headers/SKIndex.h:905: error: expected ‘=’, ‘,’, ‘;’, ‘asm’ or ‘__attribute__’ before ‘SKIndexGetDocumentTermFrequency’ | |
| /System/Library/Frameworks/CoreServices.framework/Frameworks/SearchKit.framework/Headers/SKIndex.h:928: error: expected ‘=’, ‘,’, ‘;’, ‘asm’ or ‘__attribute__’ before ‘SKIndexGetMaximumTermID’ | |
| /System/Library/Frameworks/CoreServices.framework/Frameworks/SearchKit.framework/Headers/SKIndex.h:943: error: expected ‘=’, ‘,’, ‘;’, ‘asm’ or ‘__attribute__’ before ‘SKIndexGetTermDocumentCount’ | |
| /System/Library/Frameworks/CoreServices.framework/Frameworks/SearchKit.framework/Headers/SKIndex.h:963: error: expected ‘=’, ‘,’, ‘;’, ‘asm’ or ‘__attribute__’ before ‘SKIndexCopyDocumentIDArrayForTermID’ | |
| /System/Library/Frameworks/CoreServices.framework/Frameworks/SearchKit.framework/Headers/SKIndex.h:980: error: expected ‘=’, ‘,’, ‘;’, ‘asm’ or ‘__attribute__’ before ‘SKIndexCopyTermStringForTermID’ | |
| /System/Library/Frameworks/CoreServices.framework/Frameworks/SearchKit.framework/Headers/SKIndex.h:1000: error: expected ‘=’, ‘,’, ‘;’, ‘asm’ or ‘__attribute__’ before ‘SKIndexGetTermIDForTermString’ | |
| In file included from /System/Library/Frameworks/CoreServices.framework/Frameworks/SearchKit.framework/Headers/SearchKit.h:42, | |
| from /System/Library/Frameworks/CoreServices.framework/Headers/CoreServices.h:45, | |
| from ../../../../src/libuv/src/unix/darwin.c:34: | |
| /System/Library/Frameworks/CoreServices.framework/Frameworks/SearchKit.framework/Headers/SKSearch.h:79: error: expected ‘=’, ‘,’, ‘;’, ‘asm’ or ‘__attribute__’ before ‘SKSearchGetTypeID’ | |
| /System/Library/Frameworks/CoreServices.framework/Frameworks/SearchKit.framework/Headers/SKSearch.h:90: error: expected ‘=’, ‘,’, ‘;’, ‘asm’ or ‘__attribute__’ before ‘SKSearchOptions’ | |
| /System/Library/Frameworks/CoreServices.framework/Frameworks/SearchKit.framework/Headers/SKSearch.h:131: error: expected declaration specifiers or ‘...’ before ‘CFStringRef’ | |
| /System/Library/Frameworks/CoreServices.framework/Frameworks/SearchKit.framework/Headers/SKSearch.h:132: error: expected declaration specifiers or ‘...’ before ‘SKSearchOptions’ | |
| /System/Library/Frameworks/CoreServices.framework/Frameworks/SearchKit.framework/Headers/SKSearch.h:195: error: expected ‘=’, ‘,’, ‘;’, ‘asm’ or ‘__attribute__’ before ‘SKSearchFindMatches’ | |
| /System/Library/Frameworks/CoreServices.framework/Frameworks/SearchKit.framework/Headers/SKSearch.h:238: error: expected declaration specifiers or ‘...’ before ‘CFIndex’ | |
| /System/Library/Frameworks/CoreServices.framework/Frameworks/SearchKit.framework/Headers/SKSearch.h:239: error: expected declaration specifiers or ‘...’ before ‘SKDocumentID’ | |
| /System/Library/Frameworks/CoreServices.framework/Frameworks/SearchKit.framework/Headers/SKSearch.h:240: error: expected declaration specifiers or ‘...’ before ‘CFStringRef’ | |
| /System/Library/Frameworks/CoreServices.framework/Frameworks/SearchKit.framework/Headers/SKSearch.h:241: error: expected declaration specifiers or ‘...’ before ‘SKDocumentID’ | |
| /System/Library/Frameworks/CoreServices.framework/Frameworks/SearchKit.framework/Headers/SKSearch.h:272: error: expected declaration specifiers or ‘...’ before ‘CFIndex’ | |
| /System/Library/Frameworks/CoreServices.framework/Frameworks/SearchKit.framework/Headers/SKSearch.h:273: error: expected declaration specifiers or ‘...’ before ‘SKDocumentID’ | |
| /System/Library/Frameworks/CoreServices.framework/Frameworks/SearchKit.framework/Headers/SKSearch.h:274: error: expected declaration specifiers or ‘...’ before ‘SKDocumentRef’ | |
| /System/Library/Frameworks/CoreServices.framework/Frameworks/SearchKit.framework/Headers/SKSearch.h:305: error: expected declaration specifiers or ‘...’ before ‘CFIndex’ | |
| /System/Library/Frameworks/CoreServices.framework/Frameworks/SearchKit.framework/Headers/SKSearch.h:306: error: expected declaration specifiers or ‘...’ before ‘SKDocumentID’ | |
| /System/Library/Frameworks/CoreServices.framework/Frameworks/SearchKit.framework/Headers/SKSearch.h:307: error: expected declaration specifiers or ‘...’ before ‘CFURLRef’ | |
| /System/Library/Frameworks/CoreServices.framework/Frameworks/SearchKit.framework/Headers/SKSearch.h:336: error: expected ‘=’, ‘,’, ‘;’, ‘asm’ or ‘__attribute__’ before ‘SKSearchGroupGetTypeID’ | |
| /System/Library/Frameworks/CoreServices.framework/Frameworks/SearchKit.framework/Headers/SKSearch.h:359: error: expected ‘=’, ‘,’, ‘;’, ‘asm’ or ‘__attribute__’ before ‘SKSearchResultsGetTypeID’ | |
| /System/Library/Frameworks/CoreServices.framework/Frameworks/SearchKit.framework/Headers/SKSearch.h:411: error: expected declaration specifiers or ‘...’ before ‘SKDocumentRef’ | |
| /System/Library/Frameworks/CoreServices.framework/Frameworks/SearchKit.framework/Headers/SKSearch.h:411: error: ‘CALLBACK_API_C’ declared as function returning a function | |
| /System/Library/Frameworks/CoreServices.framework/Frameworks/SearchKit.framework/Headers/SKSearch.h:435: error: expected ‘)’ before ‘inArrayOfInIndexes’ | |
| /System/Library/Frameworks/CoreServices.framework/Frameworks/SearchKit.framework/Headers/SKSearch.h:453: error: expected ‘=’, ‘,’, ‘;’, ‘asm’ or ‘__attribute__’ before ‘SKSearchGroupCopyIndexes’ | |
| /System/Library/Frameworks/CoreServices.framework/Frameworks/SearchKit.framework/Headers/SKSearch.h:501: error: expected declaration specifiers or ‘...’ before ‘CFStringRef’ | |
| /System/Library/Frameworks/CoreServices.framework/Frameworks/SearchKit.framework/Headers/SKSearch.h:503: error: expected declaration specifiers or ‘...’ before ‘CFIndex’ | |
| /System/Library/Frameworks/CoreServices.framework/Frameworks/SearchKit.framework/Headers/SKSearch.h:505: error: expected declaration specifiers or ‘...’ before ‘SKSearchResultsFilterCallBack’ | |
| /System/Library/Frameworks/CoreServices.framework/Frameworks/SearchKit.framework/Headers/SKSearch.h:551: error: expected declaration specifiers or ‘...’ before ‘CFArrayRef’ | |
| /System/Library/Frameworks/CoreServices.framework/Frameworks/SearchKit.framework/Headers/SKSearch.h:552: error: expected declaration specifiers or ‘...’ before ‘CFIndex’ | |
| /System/Library/Frameworks/CoreServices.framework/Frameworks/SearchKit.framework/Headers/SKSearch.h:554: error: expected declaration specifiers or ‘...’ before ‘SKSearchResultsFilterCallBack’ | |
| /System/Library/Frameworks/CoreServices.framework/Frameworks/SearchKit.framework/Headers/SKSearch.h:569: error: expected ‘=’, ‘,’, ‘;’, ‘asm’ or ‘__attribute__’ before ‘SKSearchResultsGetCount’ | |
| /System/Library/Frameworks/CoreServices.framework/Frameworks/SearchKit.framework/Headers/SKSearch.h:618: error: expected ‘=’, ‘,’, ‘;’, ‘asm’ or ‘__attribute__’ before ‘SKSearchResultsGetInfoInRange’ | |
| /System/Library/Frameworks/CoreServices.framework/Frameworks/SearchKit.framework/Headers/SKSearch.h:650: error: expected ‘=’, ‘,’, ‘;’, ‘asm’ or ‘__attribute__’ before ‘SKSearchResultsCopyMatchingTerms’ | |
| In file included from /System/Library/Frameworks/CoreServices.framework/Frameworks/SearchKit.framework/Headers/SearchKit.h:46, | |
| from /System/Library/Frameworks/CoreServices.framework/Headers/CoreServices.h:45, | |
| from ../../../../src/libuv/src/unix/darwin.c:34: | |
| /System/Library/Frameworks/CoreServices.framework/Frameworks/SearchKit.framework/Headers/SKSummary.h:69: error: expected ‘=’, ‘,’, ‘;’, ‘asm’ or ‘__attribute__’ before ‘SKSummaryGetTypeID’ | |
| /System/Library/Frameworks/CoreServices.framework/Frameworks/SearchKit.framework/Headers/SKSummary.h:97: error: expected ‘)’ before ‘inString’ | |
| /System/Library/Frameworks/CoreServices.framework/Frameworks/SearchKit.framework/Headers/SKSummary.h:117: error: expected ‘=’, ‘,’, ‘;’, ‘asm’ or ‘__attribute__’ before ‘SKSummaryGetSentenceCount’ | |
| /System/Library/Frameworks/CoreServices.framework/Frameworks/SearchKit.framework/Headers/SKSummary.h:137: error: expected ‘=’, ‘,’, ‘;’, ‘asm’ or ‘__attribute__’ before ‘SKSummaryGetParagraphCount’ | |
| /System/Library/Frameworks/CoreServices.framework/Frameworks/SearchKit.framework/Headers/SKSummary.h:160: error: expected ‘=’, ‘,’, ‘;’, ‘asm’ or ‘__attribute__’ before ‘SKSummaryCopySentenceAtIndex’ | |
| /System/Library/Frameworks/CoreServices.framework/Frameworks/SearchKit.framework/Headers/SKSummary.h:185: error: expected ‘=’, ‘,’, ‘;’, ‘asm’ or ‘__attribute__’ before ‘SKSummaryCopyParagraphAtIndex’ | |
| /System/Library/Frameworks/CoreServices.framework/Frameworks/SearchKit.framework/Headers/SKSummary.h:211: error: expected ‘=’, ‘,’, ‘;’, ‘asm’ or ‘__attribute__’ before ‘SKSummaryCopySentenceSummaryString’ | |
| /System/Library/Frameworks/CoreServices.framework/Frameworks/SearchKit.framework/Headers/SKSummary.h:237: error: expected ‘=’, ‘,’, ‘;’, ‘asm’ or ‘__attribute__’ before ‘SKSummaryCopyParagraphSummaryString’ | |
| /System/Library/Frameworks/CoreServices.framework/Frameworks/SearchKit.framework/Headers/SKSummary.h:278: error: expected ‘=’, ‘,’, ‘;’, ‘asm’ or ‘__attribute__’ before ‘SKSummaryGetSentenceSummaryInfo’ | |
| /System/Library/Frameworks/CoreServices.framework/Frameworks/SearchKit.framework/Headers/SKSummary.h:318: error: expected ‘=’, ‘,’, ‘;’, ‘asm’ or ‘__attribute__’ before ‘SKSummaryGetParagraphSummaryInfo’ | |
| ../../../../src/libuv/src/unix/darwin.c: In function ‘uv_hrtime’: | |
| ../../../../src/libuv/src/unix/darwin.c:66: error: ‘Nanoseconds’ undeclared (first use in this function) | |
| ../../../../src/libuv/src/unix/darwin.c:66: error: (Each undeclared identifier is reported only once | |
| ../../../../src/libuv/src/unix/darwin.c:66: error: for each function it appears in.) | |
| ../../../../src/libuv/src/unix/darwin.c:66: error: expected ‘;’ before ‘enano’ | |
| ../../../../src/libuv/src/unix/darwin.c:68: error: ‘enano’ undeclared (first use in this function) | |
| ../../../../src/libuv/src/unix/darwin.c:68: warning: implicit declaration of function ‘AbsoluteToNanoseconds’ | |
| ../../../../src/libuv/src/unix/darwin.c:68: error: ‘AbsoluteTime’ undeclared (first use in this function) | |
| ../../../../src/libuv/src/unix/darwin.c:68: error: expected expression before ‘)’ token | |
| make[1]: *** [/Users/tchevalier/rust/build//rt/x86_64-apple-darwin/libuv/Release/obj.target/uv/src/libuv/src/unix/darwin.o] Error 1 | |
| make: *** [rt/x86_64-apple-darwin/libuv/Release/libuv.a] Error 2 |
Sign up for free
to join this conversation on GitHub.
Already have an account?
Sign in to comment