Skip to content

Instantly share code, notes, and snippets.

@fpigerre
Created May 13, 2014 06:50
Show Gist options
  • Select an option

  • Save fpigerre/cf65dd8ebb98164ef943 to your computer and use it in GitHub Desktop.

Select an option

Save fpigerre/cf65dd8ebb98164ef943 to your computer and use it in GitHub Desktop.
A maven error log pertaining to AnomalousRei/OresomeRPG#2
Downloading: http://repo.maven.apache.org/maven2/org/bukkit/bukkit/maven-metadat
a.xml
Downloading: http://assets.oresomecraft.com/maven/org/bukkit/bukkit/maven-metada
ta.xml
Downloaded: http://repo.bukkit.org/content/groups/public/org/bukkit/bukkit/maven
-metadata.xml (6 KB at 3.8 KB/sec)
[WARNING] Could not transfer metadata org.bukkit:bukkit/maven-metadata.xml from/
to OresomeCraft (http://assets.oresomecraft.com/maven): Failed to transfer file:
http://assets.oresomecraft.com/maven/org/bukkit/bukkit/maven-metadata.xml. Retu
rn code is: 500 , ReasonPhrase:Internal Server Error.
Downloading: http://repo.bukkit.org/content/groups/public/org/bukkit/bukkit/1.7.
9-R0.1-SNAPSHOT/maven-metadata.xml
Downloaded: http://repo.bukkit.org/content/groups/public/org/bukkit/bukkit/1.7.9
-R0.1-SNAPSHOT/maven-metadata.xml (1000 B at 1.7 KB/sec)
[WARNING] Failure to transfer org.bukkit:bukkit/maven-metadata.xml from http://a
ssets.oresomecraft.com/maven was cached in the local repository, resolution will
not be reattempted until the update interval of OresomeCraft has elapsed or upd
ates are forced. Original error: Could not transfer metadata org.bukkit:bukkit/m
aven-metadata.xml from/to OresomeCraft (http://assets.oresomecraft.com/maven): F
ailed to transfer file: http://assets.oresomecraft.com/maven/org/bukkit/bukkit/m
aven-metadata.xml. Return code is: 500 , ReasonPhrase:Internal Server Error.
Downloading: http://repo.maven.apache.org/maven2/org/bukkit/craftbukkit/maven-me
tadata.xml
Downloading: http://repo.bukkit.org/content/groups/public/org/bukkit/craftbukkit
/maven-metadata.xml
Downloading: http://assets.oresomecraft.com/maven/org/bukkit/craftbukkit/maven-m
etadata.xml
Downloaded: http://repo.bukkit.org/content/groups/public/org/bukkit/craftbukkit/
maven-metadata.xml (6 KB at 5.9 KB/sec)
[WARNING] Could not transfer metadata org.bukkit:craftbukkit/maven-metadata.xml
from/to OresomeCraft (http://assets.oresomecraft.com/maven): Failed to transfer
file: http://assets.oresomecraft.com/maven/org/bukkit/craftbukkit/maven-metadata
.xml. Return code is: 500 , ReasonPhrase:Internal Server Error.
Downloading: http://repo.bukkit.org/content/groups/public/org/bukkit/craftbukkit
/1.7.9-R0.1-SNAPSHOT/maven-metadata.xml
Downloaded: http://repo.bukkit.org/content/groups/public/org/bukkit/craftbukkit/
1.7.9-R0.1-SNAPSHOT/maven-metadata.xml (1009 B at 1.7 KB/sec)
[WARNING] Failure to transfer org.bukkit:craftbukkit/maven-metadata.xml from htt
p://assets.oresomecraft.com/maven was cached in the local repository, resolution
will not be reattempted until the update interval of OresomeCraft has elapsed o
r updates are forced. Original error: Could not transfer metadata org.bukkit:cra
ftbukkit/maven-metadata.xml from/to OresomeCraft (http://assets.oresomecraft.com
/maven): Failed to transfer file: http://assets.oresomecraft.com/maven/org/bukki
t/craftbukkit/maven-metadata.xml. Return code is: 500 , ReasonPhrase:Internal Se
rver Error.
Downloading: http://assets.oresomecraft.com/maven/org/bukkit/craftbukkit/1.7.9-R
0.1-SNAPSHOT/craftbukkit-1.7.9-R0.1-20140513.050936-22.pom
Downloading: http://repo.bukkit.org/content/groups/public/org/bukkit/craftbukkit
/1.7.9-R0.1-SNAPSHOT/craftbukkit-1.7.9-R0.1-20140513.050936-22.pom
Downloaded: http://repo.bukkit.org/content/groups/public/org/bukkit/craftbukkit/
1.7.9-R0.1-SNAPSHOT/craftbukkit-1.7.9-R0.1-20140513.050936-22.pom (12 KB at 10.5
KB/sec)
Downloading: http://repo.bukkit.org/content/groups/public/org/bukkit/craftbukkit
/1.7.9-R0.1-SNAPSHOT/craftbukkit-1.7.9-R0.1-20140513.050936-22.jar
Downloaded: http://repo.bukkit.org/content/groups/public/org/bukkit/craftbukkit/
1.7.9-R0.1-SNAPSHOT/craftbukkit-1.7.9-R0.1-20140513.050936-22.jar (19972 KB at 1
631.5 KB/sec)
[INFO]
[INFO] --- maven-clean-plugin:2.5:clean (default-clean) @ OresomeRPG ---
[INFO] Deleting C:\Users\psgs\Documents\GitHub\OresomeRPG\target
[INFO]
[INFO] --- maven-resources-plugin:2.6:resources (default-resources) @ OresomeRPG
---
[INFO] Using 'UTF-8' encoding to copy filtered resources.
[INFO] Copying 2 resources to .
[INFO]
[INFO] --- maven-compiler-plugin:2.3.2:compile (default-compile) @ OresomeRPG --
-
[INFO] Compiling 36 source files to C:\Users\psgs\Documents\GitHub\OresomeRP
G\target\classes
[INFO]
[INFO] --- maven-resources-plugin:2.6:testResources (default-testResources) @ Or
esomeRPG ---
[INFO] Using 'UTF-8' encoding to copy filtered resources.
[INFO] skip non existing resourceDirectory C:\Users\psgs\Documents\GitHub\Or
esomeRPG\src\test\resources
[INFO]
[INFO] --- maven-compiler-plugin:2.3.2:testCompile (default-testCompile) @ Oreso
meRPG ---
[INFO] No sources to compile
[INFO]
[INFO] --- maven-surefire-plugin:2.12.4:test (default-test) @ OresomeRPG ---
[INFO] No tests to run.
[INFO]
[INFO] --- maven-jar-plugin:2.4:jar (default-jar) @ OresomeRPG ---
[INFO] Building jar: C:\Users\psgs\Documents\GitHub\OresomeRPG\target\Oresom
eRPG.jar
[INFO]
[INFO] --- maven-shade-plugin:2.0:shade (default) @ OresomeRPG ---
[INFO] Excluding org.bukkit:bukkit:jar:1.7.9-R0.1-SNAPSHOT from the shaded jar.
[INFO] Excluding org.bukkit:craftbukkit:jar:1.7.9-R0.1-SNAPSHOT from the shaded
jar.
[INFO] Including com.sk89q:sk89q-command-framework:jar:0.3 in the shaded jar.
[INFO] Replacing original artifact with shaded artifact.
[INFO] Replacing C:\Users\psgs\Documents\GitHub\OresomeRPG\target\OresomeRPG
.jar with C:\Users\psgs\Documents\GitHub\OresomeRPG\target\OresomeRPG-1.0-sh
aded.jar
[INFO] Dependency-reduced POM written at: C:\Users\psgs\Documents\GitHub\Ore
someRPG\dependency-reduced-pom.xml
[WARNING] Error injecting: org.apache.maven.shared.dependency.graph.internal.Mav
en3DependencyGraphBuilder
java.lang.NoClassDefFoundError: org/sonatype/aether/version/VersionConstraint
at java.lang.Class.getDeclaredMethods0(Native Method)
at java.lang.Class.privateGetDeclaredMethods(Class.java:2531)
at java.lang.Class.getDeclaredMethods(Class.java:1855)
at com.google.inject.spi.InjectionPoint.getInjectionPoints(InjectionPoin
t.java:674)
at com.google.inject.spi.InjectionPoint.forInstanceMethodsAndFields(Inje
ctionPoint.java:366)
at com.google.inject.internal.ConstructorBindingImpl.getInternalDependen
cies(ConstructorBindingImpl.java:165)
at com.google.inject.internal.InjectorImpl.getInternalDependencies(Injec
torImpl.java:609)
at com.google.inject.internal.InjectorImpl.cleanup(InjectorImpl.java:565
)
at com.google.inject.internal.InjectorImpl.initializeJitBinding(Injector
Impl.java:551)
at com.google.inject.internal.InjectorImpl.createJustInTimeBinding(Injec
torImpl.java:865)
at com.google.inject.internal.InjectorImpl.createJustInTimeBindingRecurs
ive(InjectorImpl.java:790)
at com.google.inject.internal.InjectorImpl.getJustInTimeBinding(Injector
Impl.java:278)
at com.google.inject.internal.InjectorImpl.getBindingOrThrow(InjectorImp
l.java:210)
at com.google.inject.internal.InjectorImpl.getProviderOrThrow(InjectorIm
pl.java:986)
at com.google.inject.internal.InjectorImpl.getProvider(InjectorImpl.java
:1019)
at com.google.inject.internal.InjectorImpl.getProvider(InjectorImpl.java
:982)
at com.google.inject.internal.InjectorImpl.getInstance(InjectorImpl.java
:1032)
at org.eclipse.sisu.space.AbstractDeferredClass.get(AbstractDeferredClas
s.java:48)
at com.google.inject.internal.ProviderInternalFactory.provision(Provider
InternalFactory.java:86)
at com.google.inject.internal.InternalFactoryToInitializableAdapter.prov
ision(InternalFactoryToInitializableAdapter.java:55)
at com.google.inject.internal.ProviderInternalFactory$1.call(ProviderInt
ernalFactory.java:70)
at com.google.inject.internal.ProvisionListenerStackCallback$Provision.p
rovision(ProvisionListenerStackCallback.java:100)
at org.eclipse.sisu.plexus.PlexusLifecycleManager.onProvision(PlexusLife
cycleManager.java:133)
at com.google.inject.internal.ProvisionListenerStackCallback$Provision.p
rovision(ProvisionListenerStackCallback.java:109)
at com.google.inject.internal.ProvisionListenerStackCallback.provision(P
rovisionListenerStackCallback.java:55)
at com.google.inject.internal.ProviderInternalFactory.circularGet(Provid
erInternalFactory.java:68)
at com.google.inject.internal.InternalFactoryToInitializableAdapter.get(
InternalFactoryToInitializableAdapter.java:47)
at com.google.inject.internal.ProviderToInternalFactoryAdapter$1.call(Pr
oviderToInternalFactoryAdapter.java:46)
at com.google.inject.internal.InjectorImpl.callInContext(InjectorImpl.ja
va:1054)
at com.google.inject.internal.ProviderToInternalFactoryAdapter.get(Provi
derToInternalFactoryAdapter.java:40)
at com.google.inject.Scopes$1$1.get(Scopes.java:59)
at com.google.inject.internal.InternalFactoryToProviderAdapter.get(Inter
nalFactoryToProviderAdapter.java:41)
at com.google.inject.internal.InjectorImpl$2$1.call(InjectorImpl.java:99
7)
at com.google.inject.internal.InjectorImpl.callInContext(InjectorImpl.ja
va:1047)
at com.google.inject.internal.InjectorImpl$2.get(InjectorImpl.java:993)
at org.eclipse.sisu.inject.LazyBeanEntry.getValue(LazyBeanEntry.java:82)
at org.eclipse.sisu.plexus.LazyPlexusBean.getValue(LazyPlexusBean.java:5
1)
at org.codehaus.plexus.DefaultPlexusContainer.lookup(DefaultPlexusContai
ner.java:260)
at org.codehaus.plexus.DefaultPlexusContainer.lookup(DefaultPlexusContai
ner.java:240)
at org.apache.maven.shared.dependency.graph.internal.DefaultDependencyGr
aphBuilder.buildDependencyGraph(DefaultDependencyGraphBuilder.java:60)
at org.apache.maven.plugins.shade.mojo.ShadeMojo.updateExcludesInDeps(Sh
adeMojo.java:965)
at org.apache.maven.plugins.shade.mojo.ShadeMojo.createDependencyReduced
Pom(ShadeMojo.java:938)
at org.apache.maven.plugins.shade.mojo.ShadeMojo.execute(ShadeMojo.java:
544)
at org.apache.maven.plugin.DefaultBuildPluginManager.executeMojo(Default
BuildPluginManager.java:106)
at org.apache.maven.lifecycle.internal.MojoExecutor.execute(MojoExecutor
.java:208)
at org.apache.maven.lifecycle.internal.MojoExecutor.execute(MojoExecutor
.java:153)
at org.apache.maven.lifecycle.internal.MojoExecutor.execute(MojoExecutor
.java:145)
at org.apache.maven.lifecycle.internal.LifecycleModuleBuilder.buildProje
ct(LifecycleModuleBuilder.java:84)
at org.apache.maven.lifecycle.internal.LifecycleModuleBuilder.buildProje
ct(LifecycleModuleBuilder.java:59)
at org.apache.maven.lifecycle.internal.LifecycleStarter.singleThreadedBu
ild(LifecycleStarter.java:183)
at org.apache.maven.lifecycle.internal.LifecycleStarter.execute(Lifecycl
eStarter.java:161)
at org.apache.maven.DefaultMaven.doExecute(DefaultMaven.java:317)
at org.apache.maven.DefaultMaven.execute(DefaultMaven.java:152)
at org.apache.maven.cli.MavenCli.execute(MavenCli.java:555)
at org.apache.maven.cli.MavenCli.doMain(MavenCli.java:214)
at org.apache.maven.cli.MavenCli.main(MavenCli.java:158)
at sun.reflect.NativeMethodAccessorImpl.invoke0(Native Method)
at sun.reflect.NativeMethodAccessorImpl.invoke(NativeMethodAccessorImpl.
java:57)
at sun.reflect.DelegatingMethodAccessorImpl.invoke(DelegatingMethodAcces
sorImpl.java:43)
at java.lang.reflect.Method.invoke(Method.java:606)
at org.codehaus.plexus.classworlds.launcher.Launcher.launchEnhanced(Laun
cher.java:289)
at org.codehaus.plexus.classworlds.launcher.Launcher.launch(Launcher.jav
a:229)
at org.codehaus.plexus.classworlds.launcher.Launcher.mainWithExitCode(La
uncher.java:415)
at org.codehaus.plexus.classworlds.launcher.Launcher.main(Launcher.java:
356)
Caused by: java.lang.ClassNotFoundException: org.sonatype.aether.version.Version
Constraint
at org.codehaus.plexus.classworlds.strategy.SelfFirstStrategy.loadClass(
SelfFirstStrategy.java:50)
at org.codehaus.plexus.classworlds.realm.ClassRealm.unsynchronizedLoadCl
ass(ClassRealm.java:259)
at org.codehaus.plexus.classworlds.realm.ClassRealm.loadClass(ClassRealm
.java:235)
at org.codehaus.plexus.classworlds.realm.ClassRealm.loadClass(ClassRealm
.java:227)
... 64 more
[INFO] ------------------------------------------------------------------------
[INFO] BUILD FAILURE
[INFO] ------------------------------------------------------------------------
[INFO] Total time: 22.479s
[INFO] Finished at: Tue May 13 16:39:10 EST 2014
[INFO] Final Memory: 18M/181M
[INFO] ------------------------------------------------------------------------
[ERROR] Failed to execute goal org.apache.maven.plugins:maven-shade-plugin:2.0:s
hade (default) on project OresomeRPG: Execution default of goal org.apache.maven
.plugins:maven-shade-plugin:2.0:shade failed: A required class was missing while
executing org.apache.maven.plugins:maven-shade-plugin:2.0:shade: org/sonatype/a
ether/version/VersionConstraint
[ERROR] -----------------------------------------------------
[ERROR] realm = plugin>org.apache.maven.plugins:maven-shade-plugin:2.0
[ERROR] strategy = org.codehaus.plexus.classworlds.strategy.SelfFirstStrategy
[ERROR] urls[0] = file:/C:/Users/psgs/.m2/repository/org/apache/maven/plugin
s/maven-shade-plugin/2.0/maven-shade-plugin-2.0.jar
[ERROR] urls[1] = file:/C:/Users/psgs/.m2/repository/org/sonatype/sisu/sisu-
inject-bean/1.4.2/sisu-inject-bean-1.4.2.jar
[ERROR] urls[2] = file:/C:/Users/psgs/.m2/repository/org/sonatype/sisu/sisu-
guice/2.1.7/sisu-guice-2.1.7-noaop.jar
[ERROR] urls[3] = file:/C:/Users/psgs/.m2/repository/org/sonatype/aether/aet
her-util/1.7/aether-util-1.7.jar
[ERROR] urls[4] = file:/C:/Users/psgs/.m2/repository/org/codehaus/plexus/ple
xus-interpolation/1.14/plexus-interpolation-1.14.jar
[ERROR] urls[5] = file:/C:/Users/psgs/.m2/repository/org/codehaus/plexus/ple
xus-component-annotations/1.5.5/plexus-component-annotations-1.5.5.jar
[ERROR] urls[6] = file:/C:/Users/psgs/.m2/repository/org/sonatype/plexus/ple
xus-sec-dispatcher/1.3/plexus-sec-dispatcher-1.3.jar
[ERROR] urls[7] = file:/C:/Users/psgs/.m2/repository/org/sonatype/plexus/ple
xus-cipher/1.4/plexus-cipher-1.4.jar
[ERROR] urls[8] = file:/C:/Users/psgs/.m2/repository/junit/junit/3.8.1/junit
-3.8.1.jar
[ERROR] urls[9] = file:/C:/Users/psgs/.m2/repository/org/codehaus/plexus/ple
xus-utils/3.0.1/plexus-utils-3.0.1.jar
[ERROR] urls[10] = file:/C:/Users/psgs/.m2/repository/asm/asm/3.3.1/asm-3.3.
1.jar
[ERROR] urls[11] = file:/C:/Users/psgs/.m2/repository/asm/asm-commons/3.3.1/
asm-commons-3.3.1.jar
[ERROR] urls[12] = file:/C:/Users/psgs/.m2/repository/asm/asm-tree/3.3.1/asm
-tree-3.3.1.jar
[ERROR] urls[13] = file:/C:/Users/psgs/.m2/repository/org/jdom/jdom/1.1/jdom
-1.1.jar
[ERROR] urls[14] = file:/C:/Users/psgs/.m2/repository/org/apache/maven/share
d/maven-dependency-tree/2.0/maven-dependency-tree-2.0.jar
[ERROR] urls[15] = file:/C:/Users/psgs/.m2/repository/backport-util-concurre
nt/backport-util-concurrent/3.1/backport-util-concurrent-3.1.jar
[ERROR] urls[16] = file:/C:/Users/psgs/.m2/repository/org/vafer/jdependency/
0.7/jdependency-0.7.jar
[ERROR] urls[17] = file:/C:/Users/psgs/.m2/repository/commons-io/commons-io/
1.3.2/commons-io-1.3.2.jar
[ERROR] urls[18] = file:/C:/Users/psgs/.m2/repository/asm/asm-analysis/3.2/a
sm-analysis-3.2.jar
[ERROR] urls[19] = file:/C:/Users/psgs/.m2/repository/asm/asm-util/3.2/asm-u
til-3.2.jar
[ERROR] Number of foreign imports: 1
[ERROR] import: Entry[import from realm ClassRealm[maven.api, parent: null]]
[ERROR]
[ERROR] -----------------------------------------------------: org.sonatype.aeth
er.version.VersionConstraint
[ERROR] -> [Help 1]
[ERROR]
[ERROR] To see the full stack trace of the errors, re-run Maven with the -e swit
ch.
[ERROR] Re-run Maven using the -X switch to enable full debug logging.
[ERROR]
[ERROR] For more information about the errors and possible solutions, please rea
d the following articles:
[ERROR] [Help 1] http://cwiki.apache.org/confluence/display/MAVEN/AetherClassNot
Found
C:\Users\psgs\Documents\GitHub\OresomeRPG [master]>
Sign up for free to join this conversation on GitHub. Already have an account? Sign in to comment