Skip to content

Instantly share code, notes, and snippets.

@ianmilligan1
Created May 17, 2018 15:30
Show Gist options
  • Select an option

  • Save ianmilligan1/0c87985b3406d6a30af8dc2e3818e65d to your computer and use it in GitHub Desktop.

Select an option

Save ianmilligan1/0c87985b3406d6a30af8dc2e3818e65d to your computer and use it in GitHub Desktop.
[Stage 0:> (0 + 12) / 1147]2018-05-17 11:29:26 ERROR Executor:91 - Exception in task 8.0 in stage 0.0 (TID 8)
java.io.IOException: Invalid image dimensions
at io.archivesunleashed.matchbox.ExtractImageDetails$.apply(ExtractImageDetails.scala:62)
at io.archivesunleashed.package$WARecordRDD$$anonfun$9.apply(package.scala:147)
at io.archivesunleashed.package$WARecordRDD$$anonfun$9.apply(package.scala:146)
at scala.collection.Iterator$$anon$11.next(Iterator.scala:409)
at scala.collection.Iterator$$anon$11.next(Iterator.scala:409)
at scala.collection.Iterator$$anon$11.next(Iterator.scala:409)
at scala.collection.Iterator$$anon$11.next(Iterator.scala:409)
at org.apache.spark.sql.catalyst.expressions.GeneratedClass$GeneratedIteratorForCodegenStage1.processNext(Unknown Source)
at org.apache.spark.sql.execution.BufferedRowIterator.hasNext(BufferedRowIterator.java:43)
at org.apache.spark.sql.execution.WholeStageCodegenExec$$anonfun$10$$anon$1.hasNext(WholeStageCodegenExec.scala:614)
at scala.collection.Iterator$$anon$11.hasNext(Iterator.scala:408)
at scala.collection.convert.Wrappers$IteratorWrapper.hasNext(Wrappers.scala:30)
at org.spark_project.guava.collect.Ordering.leastOf(Ordering.java:628)
at org.apache.spark.util.collection.Utils$.takeOrdered(Utils.scala:37)
at org.apache.spark.rdd.RDD$$anonfun$takeOrdered$1$$anonfun$29.apply(RDD.scala:1427)
at org.apache.spark.rdd.RDD$$anonfun$takeOrdered$1$$anonfun$29.apply(RDD.scala:1424)
at org.apache.spark.rdd.RDD$$anonfun$mapPartitions$1$$anonfun$apply$23.apply(RDD.scala:800)
at org.apache.spark.rdd.RDD$$anonfun$mapPartitions$1$$anonfun$apply$23.apply(RDD.scala:800)
at org.apache.spark.rdd.MapPartitionsRDD.compute(MapPartitionsRDD.scala:38)
at org.apache.spark.rdd.RDD.computeOrReadCheckpoint(RDD.scala:324)
at org.apache.spark.rdd.RDD.iterator(RDD.scala:288)
at org.apache.spark.scheduler.ResultTask.runTask(ResultTask.scala:87)
at org.apache.spark.scheduler.Task.run(Task.scala:109)
at org.apache.spark.executor.Executor$TaskRunner.run(Executor.scala:345)
at java.util.concurrent.ThreadPoolExecutor.runWorker(ThreadPoolExecutor.java:1149)
at java.util.concurrent.ThreadPoolExecutor$Worker.run(ThreadPoolExecutor.java:624)
at java.lang.Thread.run(Thread.java:748)
2018-05-17 11:29:26 WARN TaskSetManager:66 - Lost task 8.0 in stage 0.0 (TID 8, localhost, executor driver): java.io.IOException: Invalid image dimensions
at io.archivesunleashed.matchbox.ExtractImageDetails$.apply(ExtractImageDetails.scala:62)
at io.archivesunleashed.package$WARecordRDD$$anonfun$9.apply(package.scala:147)
at io.archivesunleashed.package$WARecordRDD$$anonfun$9.apply(package.scala:146)
at scala.collection.Iterator$$anon$11.next(Iterator.scala:409)
at scala.collection.Iterator$$anon$11.next(Iterator.scala:409)
at scala.collection.Iterator$$anon$11.next(Iterator.scala:409)
at scala.collection.Iterator$$anon$11.next(Iterator.scala:409)
at org.apache.spark.sql.catalyst.expressions.GeneratedClass$GeneratedIteratorForCodegenStage1.processNext(Unknown Source)
at org.apache.spark.sql.execution.BufferedRowIterator.hasNext(BufferedRowIterator.java:43)
at org.apache.spark.sql.execution.WholeStageCodegenExec$$anonfun$10$$anon$1.hasNext(WholeStageCodegenExec.scala:614)
at scala.collection.Iterator$$anon$11.hasNext(Iterator.scala:408)
at scala.collection.convert.Wrappers$IteratorWrapper.hasNext(Wrappers.scala:30)
at org.spark_project.guava.collect.Ordering.leastOf(Ordering.java:628)
at org.apache.spark.util.collection.Utils$.takeOrdered(Utils.scala:37)
at org.apache.spark.rdd.RDD$$anonfun$takeOrdered$1$$anonfun$29.apply(RDD.scala:1427)
at org.apache.spark.rdd.RDD$$anonfun$takeOrdered$1$$anonfun$29.apply(RDD.scala:1424)
at org.apache.spark.rdd.RDD$$anonfun$mapPartitions$1$$anonfun$apply$23.apply(RDD.scala:800)
at org.apache.spark.rdd.RDD$$anonfun$mapPartitions$1$$anonfun$apply$23.apply(RDD.scala:800)
at org.apache.spark.rdd.MapPartitionsRDD.compute(MapPartitionsRDD.scala:38)
at org.apache.spark.rdd.RDD.computeOrReadCheckpoint(RDD.scala:324)
at org.apache.spark.rdd.RDD.iterator(RDD.scala:288)
at org.apache.spark.scheduler.ResultTask.runTask(ResultTask.scala:87)
at org.apache.spark.scheduler.Task.run(Task.scala:109)
at org.apache.spark.executor.Executor$TaskRunner.run(Executor.scala:345)
at java.util.concurrent.ThreadPoolExecutor.runWorker(ThreadPoolExecutor.java:1149)
at java.util.concurrent.ThreadPoolExecutor$Worker.run(ThreadPoolExecutor.java:624)
at java.lang.Thread.run(Thread.java:748)
2018-05-17 11:29:26 ERROR TaskSetManager:70 - Task 8 in stage 0.0 failed 1 times; aborting job
2018-05-17 11:29:26 WARN TaskSetManager:66 - Lost task 9.0 in stage 0.0 (TID 9, localhost, executor driver): TaskKilled (Stage cancelled)
2018-05-17 11:29:26 WARN TaskSetManager:66 - Lost task 11.0 in stage 0.0 (TID 11, localhost, executor driver): TaskKilled (Stage cancelled)
2018-05-17 11:29:26 WARN TaskSetManager:66 - Lost task 4.0 in stage 0.0 (TID 4, localhost, executor driver): TaskKilled (Stage cancelled)
2018-05-17 11:29:26 WARN TaskSetManager:66 - Lost task 12.0 in stage 0.0 (TID 12, localhost, executor driver): TaskKilled (Stage cancelled)
2018-05-17 11:29:26 WARN TaskSetManager:66 - Lost task 1.0 in stage 0.0 (TID 1, localhost, executor driver): TaskKilled (Stage cancelled)
2018-05-17 11:29:26 WARN TaskSetManager:66 - Lost task 6.0 in stage 0.0 (TID 6, localhost, executor driver): TaskKilled (Stage cancelled)
2018-05-17 11:29:26 WARN TaskSetManager:66 - Lost task 0.0 in stage 0.0 (TID 0, localhost, executor driver): TaskKilled (Stage cancelled)
2018-05-17 11:29:26 WARN TaskSetManager:66 - Lost task 10.0 in stage 0.0 (TID 10, localhost, executor driver): TaskKilled (Stage cancelled)
2018-05-17 11:29:26 WARN TaskSetManager:66 - Lost task 5.0 in stage 0.0 (TID 5, localhost, executor driver): TaskKilled (Stage cancelled)
2018-05-17 11:29:26 WARN TaskSetManager:66 - Lost task 2.0 in stage 0.0 (TID 2, localhost, executor driver): TaskKilled (Stage cancelled)
org.apache.spark.SparkException: Job aborted due to stage failure: Task 8 in stage 0.0 failed 1 times, most recent failure: Lost task 8.0 in stage 0.0 (TID 8, localhost, executor driver): java.io.IOException: Invalid image dimensions
at io.archivesunleashed.matchbox.ExtractImageDetails$.apply(ExtractImageDetails.scala:62)
at io.archivesunleashed.package$WARecordRDD$$anonfun$9.apply(package.scala:147)
at io.archivesunleashed.package$WARecordRDD$$anonfun$9.apply(package.scala:146)
at scala.collection.Iterator$$anon$11.next(Iterator.scala:409)
at scala.collection.Iterator$$anon$11.next(Iterator.scala:409)
at scala.collection.Iterator$$anon$11.next(Iterator.scala:409)
at scala.collection.Iterator$$anon$11.next(Iterator.scala:409)
at org.apache.spark.sql.catalyst.expressions.GeneratedClass$GeneratedIteratorForCodegenStage1.processNext(Unknown Source)
at org.apache.spark.sql.execution.BufferedRowIterator.hasNext(BufferedRowIterator.java:43)
at org.apache.spark.sql.execution.WholeStageCodegenExec$$anonfun$10$$anon$1.hasNext(WholeStageCodegenExec.scala:614)
at scala.collection.Iterator$$anon$11.hasNext(Iterator.scala:408)
at scala.collection.convert.Wrappers$IteratorWrapper.hasNext(Wrappers.scala:30)
at org.spark_project.guava.collect.Ordering.leastOf(Ordering.java:628)
at org.apache.spark.util.collection.Utils$.takeOrdered(Utils.scala:37)
at org.apache.spark.rdd.RDD$$anonfun$takeOrdered$1$$anonfun$29.apply(RDD.scala:1427)
at org.apache.spark.rdd.RDD$$anonfun$takeOrdered$1$$anonfun$29.apply(RDD.scala:1424)
at org.apache.spark.rdd.RDD$$anonfun$mapPartitions$1$$anonfun$apply$23.apply(RDD.scala:800)
at org.apache.spark.rdd.RDD$$anonfun$mapPartitions$1$$anonfun$apply$23.apply(RDD.scala:800)
at org.apache.spark.rdd.MapPartitionsRDD.compute(MapPartitionsRDD.scala:38)
at org.apache.spark.rdd.RDD.computeOrReadCheckpoint(RDD.scala:324)
at org.apache.spark.rdd.RDD.iterator(RDD.scala:288)
at org.apache.spark.scheduler.ResultTask.runTask(ResultTask.scala:87)
at org.apache.spark.scheduler.Task.run(Task.scala:109)
at org.apache.spark.executor.Executor$TaskRunner.run(Executor.scala:345)
at java.util.concurrent.ThreadPoolExecutor.runWorker(ThreadPoolExecutor.java:1149)
at java.util.concurrent.ThreadPoolExecutor$Worker.run(ThreadPoolExecutor.java:624)
at java.lang.Thread.run(Thread.java:748)
Driver stacktrace:
at org.apache.spark.scheduler.DAGScheduler.org$apache$spark$scheduler$DAGScheduler$$failJobAndIndependentStages(DAGScheduler.scala:1599)
at org.apache.spark.scheduler.DAGScheduler$$anonfun$abortStage$1.apply(DAGScheduler.scala:1587)
at org.apache.spark.scheduler.DAGScheduler$$anonfun$abortStage$1.apply(DAGScheduler.scala:1586)
at scala.collection.mutable.ResizableArray$class.foreach(ResizableArray.scala:59)
at scala.collection.mutable.ArrayBuffer.foreach(ArrayBuffer.scala:48)
at org.apache.spark.scheduler.DAGScheduler.abortStage(DAGScheduler.scala:1586)
at org.apache.spark.scheduler.DAGScheduler$$anonfun$handleTaskSetFailed$1.apply(DAGScheduler.scala:831)
at org.apache.spark.scheduler.DAGScheduler$$anonfun$handleTaskSetFailed$1.apply(DAGScheduler.scala:831)
at scala.Option.foreach(Option.scala:257)
at org.apache.spark.scheduler.DAGScheduler.handleTaskSetFailed(DAGScheduler.scala:831)
at org.apache.spark.scheduler.DAGSchedulerEventProcessLoop.doOnReceive(DAGScheduler.scala:1820)
at org.apache.spark.scheduler.DAGSchedulerEventProcessLoop.onReceive(DAGScheduler.scala:1769)
at org.apache.spark.scheduler.DAGSchedulerEventProcessLoop.onReceive(DAGScheduler.scala:1758)
at org.apache.spark.util.EventLoop$$anon$1.run(EventLoop.scala:48)
at org.apache.spark.scheduler.DAGScheduler.runJob(DAGScheduler.scala:642)
at org.apache.spark.SparkContext.runJob(SparkContext.scala:2027)
at org.apache.spark.SparkContext.runJob(SparkContext.scala:2124)
at org.apache.spark.rdd.RDD$$anonfun$reduce$1.apply(RDD.scala:1029)
at org.apache.spark.rdd.RDDOperationScope$.withScope(RDDOperationScope.scala:151)
at org.apache.spark.rdd.RDDOperationScope$.withScope(RDDOperationScope.scala:112)
at org.apache.spark.rdd.RDD.withScope(RDD.scala:363)
at org.apache.spark.rdd.RDD.reduce(RDD.scala:1011)
at org.apache.spark.rdd.RDD$$anonfun$takeOrdered$1.apply(RDD.scala:1433)
at org.apache.spark.rdd.RDDOperationScope$.withScope(RDDOperationScope.scala:151)
at org.apache.spark.rdd.RDDOperationScope$.withScope(RDDOperationScope.scala:112)
at org.apache.spark.rdd.RDD.withScope(RDD.scala:363)
at org.apache.spark.rdd.RDD.takeOrdered(RDD.scala:1420)
at org.apache.spark.sql.execution.TakeOrderedAndProjectExec.executeCollect(limit.scala:135)
at org.apache.spark.sql.Dataset.org$apache$spark$sql$Dataset$$collectFromPlan(Dataset.scala:3272)
at org.apache.spark.sql.Dataset$$anonfun$head$1.apply(Dataset.scala:2484)
at org.apache.spark.sql.Dataset$$anonfun$head$1.apply(Dataset.scala:2484)
at org.apache.spark.sql.Dataset$$anonfun$52.apply(Dataset.scala:3253)
at org.apache.spark.sql.execution.SQLExecution$.withNewExecutionId(SQLExecution.scala:77)
at org.apache.spark.sql.Dataset.withAction(Dataset.scala:3252)
at org.apache.spark.sql.Dataset.head(Dataset.scala:2484)
at org.apache.spark.sql.Dataset.take(Dataset.scala:2698)
at org.apache.spark.sql.Dataset.showString(Dataset.scala:254)
at org.apache.spark.sql.Dataset.show(Dataset.scala:723)
at org.apache.spark.sql.Dataset.show(Dataset.scala:682)
at org.apache.spark.sql.Dataset.show(Dataset.scala:691)
... 54 elided
Caused by: java.io.IOException: Invalid image dimensions
at io.archivesunleashed.matchbox.ExtractImageDetails$.apply(ExtractImageDetails.scala:62)
at io.archivesunleashed.package$WARecordRDD$$anonfun$9.apply(package.scala:147)
at io.archivesunleashed.package$WARecordRDD$$anonfun$9.apply(package.scala:146)
at scala.collection.Iterator$$anon$11.next(Iterator.scala:409)
at scala.collection.Iterator$$anon$11.next(Iterator.scala:409)
at scala.collection.Iterator$$anon$11.next(Iterator.scala:409)
at scala.collection.Iterator$$anon$11.next(Iterator.scala:409)
at org.apache.spark.sql.catalyst.expressions.GeneratedClass$GeneratedIteratorForCodegenStage1.processNext(Unknown Source)
at org.apache.spark.sql.execution.BufferedRowIterator.hasNext(BufferedRowIterator.java:43)
at org.apache.spark.sql.execution.WholeStageCodegenExec$$anonfun$10$$anon$1.hasNext(WholeStageCodegenExec.scala:614)
at scala.collection.Iterator$$anon$11.hasNext(Iterator.scala:408)
at scala.collection.convert.Wrappers$IteratorWrapper.hasNext(Wrappers.scala:30)
at org.spark_project.guava.collect.Ordering.leastOf(Ordering.java:628)
at org.apache.spark.util.collection.Utils$.takeOrdered(Utils.scala:37)
at org.apache.spark.rdd.RDD$$anonfun$takeOrdered$1$$anonfun$29.apply(RDD.scala:1427)
at org.apache.spark.rdd.RDD$$anonfun$takeOrdered$1$$anonfun$29.apply(RDD.scala:1424)
at org.apache.spark.rdd.RDD$$anonfun$mapPartitions$1$$anonfun$apply$23.apply(RDD.scala:800)
at org.apache.spark.rdd.RDD$$anonfun$mapPartitions$1$$anonfun$apply$23.apply(RDD.scala:800)
at org.apache.spark.rdd.MapPartitionsRDD.compute(MapPartitionsRDD.scala:38)
at org.apache.spark.rdd.RDD.computeOrReadCheckpoint(RDD.scala:324)
at org.apache.spark.rdd.RDD.iterator(RDD.scala:288)
at org.apache.spark.scheduler.ResultTask.runTask(ResultTask.scala:87)
at org.apache.spark.scheduler.Task.run(Task.scala:109)
at org.apache.spark.executor.Executor$TaskRunner.run(Executor.scala:345)
at java.util.concurrent.ThreadPoolExecutor.runWorker(ThreadPoolExecutor.java:1149)
at java.util.concurrent.ThreadPoolExecutor$Worker.run(ThreadPoolExecutor.java:624)
at java.lang.Thread.run(Thread.java:748)
scala> 2018-05-17 11:29:26 WARN TaskSetManager:66 - Lost task 3.0 in stage 0.0 (TID 3, localhost, executor driver): TaskKilled (Stage cancelled)
2018-05-17 11:29:26 WARN TaskSetManager:66 - Lost task 7.0 in stage 0.0 (TID 7, localhost, executor driver): TaskKilled (Stage cancelled)
Sign up for free to join this conversation on GitHub. Already have an account? Sign in to comment