Skip to content

Instantly share code, notes, and snippets.

@jakesays-old
Created March 14, 2016 05:06
Show Gist options
  • Select an option

  • Save jakesays-old/7f2c18154c45adf7cb7b to your computer and use it in GitHub Desktop.

Select an option

Save jakesays-old/7f2c18154c45adf7cb7b to your computer and use it in GitHub Desktop.
libcxx test output
[100%] Built target cxx
Scanning dependencies of target check-libcxx
[100%] Running libcxx tests
lit.py: lit.cfg:42: note: Using configuration variant: libcxx
lit.py: config.py:652: note: inferred target_triple as: 'armv7l-unknown-linux-gnueabihf'
lit.py: config.py:208: note: inferred use_system_cxx_lib as: False
lit.py: config.py:219: note: inferred use_clang_verify as: True
lit.py: config.py:300: note: inferred language dialect as: c++1z
lit.py: target_info.py:66: warning: The locale fr_FR.UTF-8 is not supported by your platform. Some tests will be unsupported.
lit.py: target_info.py:66: warning: The locale ru_RU.UTF-8 is not supported by your platform. Some tests will be unsupported.
lit.py: target_info.py:66: warning: The locale zh_CN.UTF-8 is not supported by your platform. Some tests will be unsupported.
lit.py: target_info.py:66: warning: The locale fr_CA.ISO8859-1 is not supported by your platform. Some tests will be unsupported.
lit.py: target_info.py:66: warning: The locale cs_CZ.ISO8859-2 is not supported by your platform. Some tests will be unsupported.
lit.py: config.py:270: note: inferred long_tests as: True
lit.py: config.py:116: note: Using compiler: /opt/clang/bin/clang++
lit.py: config.py:117: note: Using flags: ['-v']
lit.py: config.py:119: note: Using compile flags: ['-std=c++1z', '-nostdinc++', '-I/home/pi/llvm-3.8.0.src/projects/libcxx/test/support', '-include', '/home/pi/llvm-3.8.0.src/projects/libcxx/test/support/nasty_macros.hpp', '-I/home/pi/llvm-3.8.0.src/projects/libcxx/include', '-D__STDC_FORMAT_MACROS', '-D__STDC_LIMIT_MACROS', '-D__STDC_CONSTANT_MACROS']
lit.py: config.py:120: note: Using link flags: ['-nodefaultlibs', '-L/home/pi/libcxx-build/lib', '-Wl,-rpath,/home/pi/libcxx-build/lib', '-lc++', '-lm', '-lgcc_s', '-lgcc', '-lpthread', '-lc', '-lgcc_s', '-lgcc']
lit.py: config.py:123: note: Using available_features: ['debian-8.0', 'clang', 'debian', 'clang-3.8', 'linux', 'locale.en_US.UTF-8', 'fsized-deallocation', 'c++1z', 'long_tests']
lit.py: config.py:124: note: Using environment: {}
FAIL: libc++ :: libcxx/containers/sequences/vector/asan_throw.pass.cpp (5 of 5026)
******************** TEST 'libc++ :: libcxx/containers/sequences/vector/asan_throw.pass.cpp' FAILED ********************
Compiled With: ['/opt/clang/bin/clang++', '-o', '/home/pi/libcxx-build/projects/libcxx/test/libcxx/containers/sequences/vector/Output/asan_throw.pass.cpp.o', '-x', 'c++', '/home/pi/llvm-3.8.0.src/projects/libcxx/test/libcxx/containers/sequences/vector/asan_throw.pass.cpp', '-c', '-v', '-std=c++1z', '-nostdinc++', '-I/home/pi/llvm-3.8.0.src/projects/libcxx/test/support', '-include', '/home/pi/llvm-3.8.0.src/projects/libcxx/test/support/nasty_macros.hpp', '-I/home/pi/llvm-3.8.0.src/projects/libcxx/include', '-D__STDC_FORMAT_MACROS', '-D__STDC_LIMIT_MACROS', '-D__STDC_CONSTANT_MACROS', '&&', '/opt/clang/bin/clang++', '-o', '/home/pi/libcxx-build/projects/libcxx/test/libcxx/containers/sequences/vector/Output/asan_throw.pass.cpp.exe', '/home/pi/libcxx-build/projects/libcxx/test/libcxx/containers/sequences/vector/Output/asan_throw.pass.cpp.o', '-v', '-nodefaultlibs', '-L/home/pi/libcxx-build/lib', '-Wl,-rpath,/home/pi/libcxx-build/lib', '-lc++', '-lm', '-lgcc_s', '-lgcc', '-lpthread', '-lc', '-lgcc_s', '-lgcc']
Command: ['/home/pi/libcxx-build/projects/libcxx/test/libcxx/containers/sequences/vector/Output/asan_throw.pass.cpp.exe']
Exit Code: -11
Compiled test failed unexpectedly!
********************
FAIL: libc++ :: libcxx/experimental/containers/sequences/dynarray/dynarray.cons/default_throws_bad_alloc.pass.cpp (12 of 5026)
******************** TEST 'libc++ :: libcxx/experimental/containers/sequences/dynarray/dynarray.cons/default_throws_bad_alloc.pass.cpp' FAILED ********************
Compiled With: ['/opt/clang/bin/clang++', '-o', '/home/pi/libcxx-build/projects/libcxx/test/libcxx/experimental/containers/sequences/dynarray/dynarray.cons/Output/default_throws_bad_alloc.pass.cpp.o', '-x', 'c++', '/home/pi/llvm-3.8.0.src/projects/libcxx/test/libcxx/experimental/containers/sequences/dynarray/dynarray.cons/default_throws_bad_alloc.pass.cpp', '-c', '-v', '-std=c++1z', '-nostdinc++', '-I/home/pi/llvm-3.8.0.src/projects/libcxx/test/support', '-include', '/home/pi/llvm-3.8.0.src/projects/libcxx/test/support/nasty_macros.hpp', '-I/home/pi/llvm-3.8.0.src/projects/libcxx/include', '-D__STDC_FORMAT_MACROS', '-D__STDC_LIMIT_MACROS', '-D__STDC_CONSTANT_MACROS', '&&', '/opt/clang/bin/clang++', '-o', '/home/pi/libcxx-build/projects/libcxx/test/libcxx/experimental/containers/sequences/dynarray/dynarray.cons/Output/default_throws_bad_alloc.pass.cpp.exe', '/home/pi/libcxx-build/projects/libcxx/test/libcxx/experimental/containers/sequences/dynarray/dynarray.cons/Output/default_throws_bad_alloc.pass.cpp.o', '-v', '-nodefaultlibs', '-L/home/pi/libcxx-build/lib', '-Wl,-rpath,/home/pi/libcxx-build/lib', '-lc++', '-lm', '-lgcc_s', '-lgcc', '-lpthread', '-lc', '-lgcc_s', '-lgcc']
Command: ['/home/pi/libcxx-build/projects/libcxx/test/libcxx/experimental/containers/sequences/dynarray/dynarray.cons/Output/default_throws_bad_alloc.pass.cpp.exe']
Exit Code: -11
Compiled test failed unexpectedly!
********************
FAIL: libc++ :: libcxx/experimental/containers/sequences/dynarray/dynarray.cons/default.pass.cpp (14 of 5026)
******************** TEST 'libc++ :: libcxx/experimental/containers/sequences/dynarray/dynarray.cons/default.pass.cpp' FAILED ********************
Compiled With: ['/opt/clang/bin/clang++', '-o', '/home/pi/libcxx-build/projects/libcxx/test/libcxx/experimental/containers/sequences/dynarray/dynarray.cons/Output/default.pass.cpp.o', '-x', 'c++', '/home/pi/llvm-3.8.0.src/projects/libcxx/test/libcxx/experimental/containers/sequences/dynarray/dynarray.cons/default.pass.cpp', '-c', '-v', '-std=c++1z', '-nostdinc++', '-I/home/pi/llvm-3.8.0.src/projects/libcxx/test/support', '-include', '/home/pi/llvm-3.8.0.src/projects/libcxx/test/support/nasty_macros.hpp', '-I/home/pi/llvm-3.8.0.src/projects/libcxx/include', '-D__STDC_FORMAT_MACROS', '-D__STDC_LIMIT_MACROS', '-D__STDC_CONSTANT_MACROS', '&&', '/opt/clang/bin/clang++', '-o', '/home/pi/libcxx-build/projects/libcxx/test/libcxx/experimental/containers/sequences/dynarray/dynarray.cons/Output/default.pass.cpp.exe', '/home/pi/libcxx-build/projects/libcxx/test/libcxx/experimental/containers/sequences/dynarray/dynarray.cons/Output/default.pass.cpp.o', '-v', '-nodefaultlibs', '-L/home/pi/libcxx-build/lib', '-Wl,-rpath,/home/pi/libcxx-build/lib', '-lc++', '-lm', '-lgcc_s', '-lgcc', '-lpthread', '-lc', '-lgcc_s', '-lgcc']
Command: ['/home/pi/libcxx-build/projects/libcxx/test/libcxx/experimental/containers/sequences/dynarray/dynarray.cons/Output/default.pass.cpp.exe']
Exit Code: -11
Compiled test failed unexpectedly!
********************
FAIL: libc++ :: libcxx/experimental/containers/sequences/dynarray/dynarray.overview/at.pass.cpp (17 of 5026)
******************** TEST 'libc++ :: libcxx/experimental/containers/sequences/dynarray/dynarray.overview/at.pass.cpp' FAILED ********************
Compiled With: ['/opt/clang/bin/clang++', '-o', '/home/pi/libcxx-build/projects/libcxx/test/libcxx/experimental/containers/sequences/dynarray/dynarray.overview/Output/at.pass.cpp.o', '-x', 'c++', '/home/pi/llvm-3.8.0.src/projects/libcxx/test/libcxx/experimental/containers/sequences/dynarray/dynarray.overview/at.pass.cpp', '-c', '-v', '-std=c++1z', '-nostdinc++', '-I/home/pi/llvm-3.8.0.src/projects/libcxx/test/support', '-include', '/home/pi/llvm-3.8.0.src/projects/libcxx/test/support/nasty_macros.hpp', '-I/home/pi/llvm-3.8.0.src/projects/libcxx/include', '-D__STDC_FORMAT_MACROS', '-D__STDC_LIMIT_MACROS', '-D__STDC_CONSTANT_MACROS', '&&', '/opt/clang/bin/clang++', '-o', '/home/pi/libcxx-build/projects/libcxx/test/libcxx/experimental/containers/sequences/dynarray/dynarray.overview/Output/at.pass.cpp.exe', '/home/pi/libcxx-build/projects/libcxx/test/libcxx/experimental/containers/sequences/dynarray/dynarray.overview/Output/at.pass.cpp.o', '-v', '-nodefaultlibs', '-L/home/pi/libcxx-build/lib', '-Wl,-rpath,/home/pi/libcxx-build/lib', '-lc++', '-lm', '-lgcc_s', '-lgcc', '-lpthread', '-lc', '-lgcc_s', '-lgcc']
Command: ['/home/pi/libcxx-build/projects/libcxx/test/libcxx/experimental/containers/sequences/dynarray/dynarray.overview/Output/at.pass.cpp.exe']
Exit Code: -11
Compiled test failed unexpectedly!
*
Sign up for free to join this conversation on GitHub. Already have an account? Sign in to comment