Skip to content

Instantly share code, notes, and snippets.

@jhgorse
Created March 26, 2019 20:56
Show Gist options
  • Save jhgorse/2a273848c81c6061552e211c2e4a9c77 to your computer and use it in GitHub Desktop.
Save jhgorse/2a273848c81c6061552e211c2e4a9c77 to your computer and use it in GitHub Desktop.
make[3]: Leaving directory '/home/jhg/work/lmu5530_sdk/openwrt/tools/bison'
make[3]: Entering directory '/home/jhg/work/lmu5530_sdk/openwrt/tools/mklibs'
(cd /home/jhg/work/lmu5530_sdk/build_dir/host/mklibs-0.1.35; rm -f aclocal.m4; if [ -f ./configure.ac ] || [ -f ./configure.in ]; then [ -d ./autom4te.cache ] && rm -rf autom4te.cache; [ -e ./config.rpath ] || ln -s /home/jhg/work/lmu5530_sdk/scripts/config.rpath ./config.rpath; touch NEWS AUTHORS COPYING ABOUT-NLS ChangeLog; AUTOM4TE=/home/jhg/work/lmu5530_sdk/staging_dir/host/bin/autom4te AUTOCONF=/home/jhg/work/lmu5530_sdk/staging_dir/host/bin/autoconf AUTOMAKE=/home/jhg/work/lmu5530_sdk/staging_dir/host/bin/automake ACLOCAL=/home/jhg/work/lmu5530_sdk/staging_dir/host/bin/aclocal AUTOHEADER=/home/jhg/work/lmu5530_sdk/staging_dir/host/bin/autoheader LIBTOOLIZE=/home/jhg/work/lmu5530_sdk/staging_dir/host/bin/libtoolize LIBTOOL=/home/jhg/work/lmu5530_sdk/staging_dir/host/bin/libtool M4=/home/jhg/work/lmu5530_sdk/staging_dir/host/bin/m4 AUTOPOINT=true /home/jhg/work/lmu5530_sdk/staging_dir/host/bin/autoreconf -v -f -i -s -B /home/jhg/work/lmu5530_sdk/staging_dir/host/share/aclocal -I m4 -I . . || true; fi; );
autoreconf: Entering directory `.'
autoreconf: configure.ac: not using Gettext
autoreconf: running: /home/jhg/work/lmu5530_sdk/staging_dir/host/bin/aclocal -I m4 -I . --force
main::scan_file() called too early to check prototype at /home/jhg/work/lmu5530_sdk/staging_dir/host/bin/aclocal.real line 651.
configure.ac:6: warning: AC_ARG_PROGRAM was called before AC_CANONICAL_TARGET
../../lib/autoconf/general.m4:1833: AC_CANONICAL_TARGET is expanded from...
configure.ac:6: the top level
autoreconf: configure.ac: tracing
configure.ac:6: warning: AC_ARG_PROGRAM was called before AC_CANONICAL_TARGET
../../lib/autoconf/general.m4:1833: AC_CANONICAL_TARGET is expanded from...
configure.ac:6: the top level
autoreconf: configure.ac: not using Libtool
autoreconf: running: /home/jhg/work/lmu5530_sdk/staging_dir/host/bin/autoconf --include=m4 --include=. --prepend-include=/home/jhg/work/lmu5530_sdk/staging_dir/host/share/aclocal --force
configure.ac:6: warning: AC_ARG_PROGRAM was called before AC_CANONICAL_TARGET
../../lib/autoconf/general.m4:1833: AC_CANONICAL_TARGET is expanded from...
configure.ac:6: the top level
autoreconf: running: /home/jhg/work/lmu5530_sdk/staging_dir/host/bin/autoheader --include=m4 --include=. --prepend-include=/home/jhg/work/lmu5530_sdk/staging_dir/host/share/aclocal --force
configure.ac:6: warning: AC_ARG_PROGRAM was called before AC_CANONICAL_TARGET
../../lib/autoconf/general.m4:1833: AC_CANONICAL_TARGET is expanded from...
configure.ac:6: the top level
autoreconf: running: /home/jhg/work/lmu5530_sdk/staging_dir/host/bin/automake --add-missing
Unescaped left brace in regex is illegal here in regex; marked by <-- HERE in m/\${ <-- HERE ([^ \t=:+{}]+)}/ at /home/jhg/work/lmu5530_sdk/staging_dir/host/bin/automake line 4160.
autoreconf: /home/jhg/work/lmu5530_sdk/staging_dir/host/bin/automake failed with exit status: 255
(cd /home/jhg/work/lmu5530_sdk/build_dir/host/mklibs-0.1.35/; if [ -x configure ]; then cp -fpR /home/jhg/work/lmu5530_sdk/scripts/config.{guess,sub} /home/jhg/work/lmu5530_sdk/build_dir/host/mklibs-0.1.35// && /bin/bash ./configure CC="ccache gcc" CFLAGS="-O2 -I/home/jhg/work/lmu5530_sdk/staging_dir/host/include -I/home/jhg/work/lmu5530_sdk/openwrt/tools/mklibs/include" CPPFLAGS="-I/home/jhg/work/lmu5530_sdk/staging_dir/host/include" LDFLAGS="-L/home/jhg/work/lmu5530_sdk/staging_dir/host/lib " SHELL="/bin/bash" --target=x86_64-linux-gnu --host=x86_64-linux-gnu --build=x86_64-linux-gnu --program-prefix="" --program-suffix="" --prefix=/home/jhg/work/lmu5530_sdk/staging_dir/host --exec-prefix=/home/jhg/work/lmu5530_sdk/staging_dir/host --sysconfdir=/home/jhg/work/lmu5530_sdk/staging_dir/host/etc --localstatedir=/home/jhg/work/lmu5530_sdk/staging_dir/host/var --sbindir=/home/jhg/work/lmu5530_sdk/staging_dir/host/bin ; fi )
configure: error: cannot find install-sh, install.sh, or shtool in "." "./.." "./../.."
Makefile:35: recipe for target '/home/jhg/work/lmu5530_sdk/build_dir/host/mklibs-0.1.35/.configured' failed
make[3]: *** [/home/jhg/work/lmu5530_sdk/build_dir/host/mklibs-0.1.35/.configured] Error 1
make[3]: Leaving directory '/home/jhg/work/lmu5530_sdk/openwrt/tools/mklibs'
tools/Makefile:157: recipe for target 'tools/mklibs/compile' failed
make[2]: *** [tools/mklibs/compile] Error 2
make[2]: Leaving directory '/home/jhg/work/lmu5530_sdk'
tools/Makefile:156: recipe for target '/home/jhg/work/lmu5530_sdk/staging_dir/lmu_target-arm_fa526_uClibc-0.9.33.2_eabi/stamp/.tools_install_yynyyynynynyyyyyyyyyynyyyyyyyynyyyynnyyynnyynnnyyyy' failed
make[1]: *** [/home/jhg/work/lmu5530_sdk/staging_dir/lmu_target-arm_fa526_uClibc-0.9.33.2_eabi/stamp/.tools_install_yynyyynynynyyyyyyyyyynyyyyyyyynyyyynnyyynnyynnnyyyy] Error 2
make[1]: Leaving directory '/home/jhg/work/lmu5530_sdk'
/home/jhg/work/lmu5530_sdk/include/toplevel.mk:175: recipe for target 'world' failed
make: *** [world] Error 2
Sign up for free to join this conversation on GitHub. Already have an account? Sign in to comment