Created
September 27, 2013 21:14
-
-
Save jml/6735280 to your computer and use it in GitHub Desktop.
This file contains hidden or bidirectional Unicode text that may be interpreted or compiled differently than what appears below. To review, open the file in an editor that reveals hidden Unicode characters.
Learn more about bidirectional Unicode characters
| $ testr run | |
| running=${PYTHON:-python} -m subunit.run discover . | |
| �)7.edn.tests.test_ast.EDNTestCase.test_bad_floats�p�D�)4+edn.tests.test_ast.EDNTestCase.test_booleanyG��)6-edn.tests.test_ast.EDNTestCase.test_characterb�г)4+edn.tests.test_ast.EDNTestCase.test_commentg�܀�)4+edn.tests.test_ast.EDNTestCase.test_discard�&�)2)edn.tests.test_ast.EDNTestCase.test_floatW1ݙ�)4+edn.tests.test_ast.EDNTestCase.test_integer��%��)4+edn.tests.test_ast.EDNTestCase.test_keyword�Q�׳)1(edn.tests.test_ast.EDNTestCase.test_listd�Lͳ)0'edn.tests.test_ast.EDNTestCase.test_map��.dz)0'edn.tests.test_ast.EDNTestCase.test_nilp[Fٳ)0'edn.tests.test_ast.EDNTestCase.test_set�|���)3*edn.tests.test_ast.EDNTestCase.test_stringt�In�)3*edn.tests.test_ast.EDNTestCase.test_symbol��>�)0'edn.tests.test_ast.EDNTestCase.test_tag>�3��)4+edn.tests.test_ast.EDNTestCase.test_unicode s:��)3*edn.tests.test_ast.EDNTestCase.test_vector�Z���)8/edn.tests.test_ast.ParseTestCase.test_structure4���)90edn.tests.test_ast.UnparseTestCase.test_booleans��+�):1edn.tests.test_ast.UnparseTestCase.test_character�4Ƴ)90edn.tests.test_ast.UnparseTestCase.test_escaping�d��)6-edn.tests.test_ast.UnparseTestCase.test_float�݂l�)8/edn.tests.test_ast.UnparseTestCase.test_integer_�=6���ܳ)4+edn.tests.test_ast.UnparseTestCase.test_map��is�)90edn.tests.test_ast.UnparseTestCase.test_newlines����)4+edn.tests.test_ast.UnparseTestCase.test_nilgm�)4+edn.tests.test_ast.UnparseTestCase.test_set�@��)?6edn.tests.test_ast.UnparseTestCase.test_simple_strings����)7.edn.tests.test_ast.UnparseTestCase.test_symbol�����)=4edn.tests.test_ast.UnparseTestCase.test_tagged_value.��P�)8/edn.tests.test_ast.UnparseTestCase.test_unicode�"]�)7.edn.tests.test_ast.UnparseTestCase.test_vectorY=�L�)7.edn.tests.test_extended.DecoderTests.test_bool�w���)<3edn.tests.test_extended.DecoderTests.test_characterb�Rҳ)@H>edn.tests.test_extended.DecoderTests.test_default_tagged_valueN�yʳ)7.edn.tests.test_extended.DecoderTests.test_inst���Ƴ)?6edn.tests.test_extended.DecoderTests.test_inst_with_tz�a� �)@L@Aedn.tests.test_extended.DecoderTests.test_inst_without_fractional�}8ٳ):1edn.tests.test_extended.DecoderTests.test_keyword�p&q�)7.edn.tests.test_extended.DecoderTests.test_list�>Lq�)6-edn.tests.test_extended.DecoderTests.test_map5?��)7.edn.tests.test_extended.DecoderTests.test_none�f���):1edn.tests.test_extended.DecoderTests.test_numbers�}���):1edn.tests.test_extende>�)90edn.tests.test_extended.DecoderTests.test_symboll{�U�)?6edn.tests.test_extended.DecoderTests.test_tagged_valuerȡ:�)7.edn.tests.test_extended.DecoderTests.test_uuid'��ϳ)90edn.tests.test_extended.DecoderTests.test_vector�����)@I?edn.tests.test_extended.DumpsTestCase.test_arbitrary_namedtuple;���);2edn.tests.test_extended.DumpsTestCase.test_complex�)@B8edn.tests.test_extended.DumpsTestCase.test_custom_writer|&)��)<3edn.tests.test_extended.DumpsTestCase.test_datetime�M��)@E;edn.tests.test_extended.DumpsTestCase.test_datetime_with_tz�R�$�)@C9edn.tests.test_extended.DumpsTestCase.test_escaped_string%�w��)8/edn.tests.test_extended.DumpsTestCase.test_null9~�s�)8/edn.tests.test_extended.DumpsTestCase.test_uuid��n��)@A7edn.tests.test_extended.EncoderTests.test_custom_writer?�w%�);2edn.tests.test_extended.EncoderTests.test_datetime!���):1edn.tests.test_extended.EncoderTests.test_keyword��#��)6-edn.tests.test_extended.EncoderTests.test_map��'X�)@H>edn.tests.test_extended.EncoderTests.test_nested_custom_writernD4_�)>5edn.tests.test_extended.EncoderTests.test_nested_listAwqo�)=4edn.tests.test_extended.EncoderTests.test_nested_mapPE���)=4edn.tests.test_extended.EncoderTests.test_nested_set%� | |
| ��)@A7edn.tests.test_extended.EncoderTests.test_nested_vectorrw�˳)7.edn.tests.test_extended.EncoderTests.test_none��[��)6-edn.tests.�?�)90edn.tests.test_extended.EncoderTests.test_string�t!9�)90edn.tests.test_extended.EncoderTests.test_symbol��i�)?6edn.tests.test_extended.EncoderTests.test_tagged_valueE|���)8/edn.tests.test_extended.EncoderTests.test_tuple�6u�)7.edn.tests.test_extended.EncoderTests.test_uuidnM | |
| ��)@C9edn.tests.test_extended.LoadsTestCase.test_custom_default���۳)>5edn.tests.test_extended.LoadsTestCase.test_custom_tag�~0Z�)@N@Cedn.tests.test_extended.LoadsTestCase.test_custom_tag_doesnt_mutate}pX)�);2edn.tests.test_extended.LoadsTestCase.test_numbers���)=4edn.tests.test_extended.LoadsTestCase.test_structureꢵ(�+?RE����6�.edn.tests.test_ast.EDNTestCase.test_bad_floatsb�-��+?RE������.edn.tests.test_ast.EDNTestCase.test_bad_floats�]9r�+<RE������+edn.tests.test_ast.EDNTestCase.test_booleanU�V+�+<RE����P�+edn.tests.test_ast.EDNTestCase.test_boolean}� �+>RE�����h-edn.tests.test_ast.EDNTestCase.test_character��/��+>RE�����h-edn.tests.test_ast.EDNTestCase.test_character�ޭ�+<RE�����+edn.tests.test_ast.EDNTestCase.test_comment=7l�+<RE����K�+edn.tests.test_ast.EDNTestCase.test_comment��8Ƴ+<RE���כ�+edn.tests.test_ast.EDNTestCase.test_discard��a��+<RE����+edn.tests.test_ast.EDNTestCase.test_discardCnjM�+:RE��� ��)edn.tests.test_ast.EDNTestCase.test_float �G��+:RE���#�0)edn.tests.test_ast.EDNTestCase.test_float��p�+<RE���$��+edn.tests.test_ast.EDNTestCase.test_integerMK�|�+<RE���0 | |
| h+edn.tests.test_ast.EDNTestCase.test_integer�*Գ+<RE���1`@+edn.tests.test_ast.EDNTestCase.test_keywordQ!�+<RE���G.H+edn.tests.test_ast.EDNTestCase.test_keyword���f�+9RE���H� (edn.tests.test_ast.EDNTestCase.test_list�sT�+9RE���ԕ�(edn.tests.test_ast.EDNTestCase.test_listp0��+8RE����/�'edn.tests.test_ast.EDNTestCase.test_map�pZ��+8RE���k8'edn.tests.test_ast.EDNTestCase.test_map�����+8RE���lp�'edn.tests.test_ast.EDNTestCase.test_nilዖ�+8RE���m��'edn.tests.test_ast.EDNTestCase.test_nil�P�0�+8RE���oZ�'edn.tests.test_ast.EDNTestCase.test_setB�'��+8RE����X'edn.tests.test_ast.EDNTestCase.test_set��?ϳ+;RE����}�*edn.tests.test_ast.EDNTestCase.test_string�[�5�+;RE�����*edn.tests.test_ast.EDNTestCase.test_stringsس+;RE����1p*edn.tests.test_ast.EDNTestCase.test_symbol����+;RE���t�*edn.tests.test_ast.EDNTestCase.test_symbol�����+8RE��� | |
| 0'edn.tests.test_ast.EDNTestCase.test_tag�����+8RE���c'edn.tests.test_ast.EDNTestCase.test_tag�^(�+<RE���ƈ+edn.tests.test_ast.EDNTestCase.test_unicode�G�ͳ+<RE���0+edn.tests.test_ast.EDNTestCase.test_unicode�Х�+;RE���Th*edn.tests.test_ast.EDNTestCase.test_vectorkk���+;RE���t�X*edn.tests.test_ast.EDNTestCase.test_vector�� S�+@ARE���v��/edn.tests.test_ast.ParseTestCase.test_structure���7�+@ARE���Օ�/edn.tests.test_ast.ParseTestCase.test_structure�fȐ�+@BRE���ׁ�0edn.tests.test_ast.UnparseTestCase.test_booleans$��+@BRE����R�0edn.tests.test_ast.UnparseTestCase.test_booleans�@��+@CRE���ڒ�1edn.tests.test_ast.UnparseTestCase.test_character^��z�+@CRE�����X1edn.tests.test_ast.UnparseTestCase.test_character� 0��+@BRE����#80edn.tests.test_ast.UnparseTestCase.test_escaping&��d�+@BRE����x�0edn.tests.test_ast.UnparseTestCase.test_escaping��A�+>RE������-edn.tests.test_ast.UnparseTestCase.test_float�l | |
| w�+>RE�����p-edn.tests.test_ast.UnparseTestCase.test_float���&�+@ARE������/edn.tests.test_ast.UnparseTestCase.test_integer���!�+@ARE�����/edn.tests.test_ast.UnparseTestCase.test_integer���l�+@ARE�����@/edn.tests.test_ast.UnparseTestCase.test_keyword�����+@ARE������/edn.tests.test_ast.UnparseTestCase.test_keyword[& | |
| ��+=RE�����8,edn.tests.test_ast.UnparseTestCase.test_list� | |
| �+=RE����!@,edn.tests.test_ast.UnparseTestCase.test_list�ef��+=RE����.�,edn.tests.test_ast.UnparseTestCase.test_long | |
| }��+=RE����@8,edn.tests.test_ast.UnparseTestCase.test_long�� �+<RE����I�+edn.tests.test_ast.UnparseTestCase.test_map�@�=�+<RE�����(+edn.tests.test_ast.UnparseTestCase.test_map����+@BRE����0edn.tests.test_ast.UnparseTestCase.test_newlines�{�+@BRE����˸0edn.tests.test_ast.UnparseTestCase.test_newlines6R%%�+<RE����+edn.tests.test_ast.UnparseTestCase.test_nilz�h�+<RE����H+edn.tests.test_ast.UnparseTestCase.test_nil��+<RE����8�+edn.tests.test_ast.UnparseTestCase.test_set1 | |
| Tq�+<RE���� `+edn.tests.test_ast.UnparseTestCase.test_set�;d�+@HRE�����6edn.tests.test_ast.UnparseTestCase.test_simple_stringsa�.ڳ+@HRE����W86edn.tests.test_ast.UnparseTestCase.test_simple_stringsh{�,�+?RE����d�.edn.tests.test_ast.UnparseTestCase.test_symbol��W��+?RE�����.edn.tests.test_ast.UnparseTestCase.test_symbol��8�+@FRE���� 4edn.tests.test_ast.UnparseTestCase.test_tagged_value*�j.�+@FRE���y�4edn.tests.test_ast.UnparseTestCase.test_tagged_value<�:v�+@ARE����/edn.tests.test_ast.UnparseTestCase.test_unicodeF�ϭ�+@ARE����0/edn.tests.test_ast.UnparseTestCase.test_unicode�ui�+?RE���ܸ.edn.tests.test_ast.UnparseTestCase.test_vectorj�Rm�+?RE��� ��.edn.tests.test_ast.UnparseTestCase.test_vector� | |
| ���+?RE��� | |
| �.edn.tests.test_extended.DecoderTests.test_bool|NG�+@ERE��"03edn.tests.test_extended.DecoderTests.test_characterH����+@ERE����3edn.tests.test_extended.DecoderTests.test_character����+@PRE����>edn.tests.test_extended.DecoderTests.test_default_tagged_value�W��+@PRE���Nh>edn.tests.test_extended.DecoderTests.test_default_tagged_valuejx.o�+?RE���g�.edn.tests.test_extended.DecoderTests.test_inst ˢh�+`B�RE�����.edn.tests.test_extended.DecoderTests.test_inst3text/x-traceback; charset="utf8"; language="python" tracebackBTraceback (most recent call last): | |
| File "edn/tests/test_extended.py", line 95, in test_inst | |
| result) | |
| File "/usr/lib/python2.7/unittest/case.py", line 516, in assertEqual | |
| assertion_func(first, second, msg=msg) | |
| File "/usr/lib/python2.7/unittest/case.py", line 509, in _baseAssertEqual | |
| raise self.failureException(msg) | |
| AssertionError: datetime.datetime(1985, 4, 12, 23, 20, 50, 520000, tzinfo=<iso8601.iso8601.Utc object at 0x1c14110>) != term('TaggedValue(Symbol("inst"), "\'1985-04-12T23:20:50.52Z")') | |
| ��T�+p@RE�����.edn.tests.test_extended.DecoderTests.test_inst3text/x-traceback; charset="utf8"; language="python" traceback��o�+?RE�����.edn.tests.test_extended.DecoderTests.test_inst�lU�+@HRE���%6edn.tests.test_extended.DecoderTests.test_inst_with_tz �g��+`B�RE���(26edn.tests.test_extended.DecoderTests.test_inst_with_tz3text/x-traceback; charset="utf8"; language="python" tracebackBTraceback (most recent call last): | |
| File "edn/tests/test_extended.py", line 104, in test_inst_with_tz | |
| result) | |
| File "/usr/lib/python2.7/unittest/case.py", line 516, in assertEqual | |
| assertion_func(first, second, msg=msg) | |
| File "/usr/lib/python2.7/unittest/case.py", line 509, in _baseAssertEqual | |
| raise self.failureException(msg) | |
| AssertionError: datetime.datetime(1985, 4, 12, 23, 20, 50, 520000, tzinfo=<FixedOffset '-05:30'>) != term('TaggedValue(Symbol("inst"), "\'1985-04-12T23:20:50.52-05:30")') | |
| �v��+p@�RE���(26edn.tests.test_extended.DecoderTests.test_inst_with_tz3text/x-traceback; charset="utf8"; language="python" traceback\��ֳ+@HRE���(26edn.tests.test_extended.DecoderTests.test_inst_with_tz[�CI�+@TRE���,�@Aedn.tests.test_extended.DecoderTests.test_inst_without_fractional�@�,�+`B�RE���/��@Aedn.tests.test_extended.DecoderTests.test_inst_without_fractional3text/x-traceback; charset="utf8"; language="python" tracebackBTraceback (most recent call last): | |
| File "edn/tests/test_extended.py", line 111, in test_inst_without_fractional | |
| result) | |
| File "/usr/lib/python2.7/unittest/case.py", line 516, in assertEqual | |
| assertion_func(first, second, msg=msg) | |
| File "/usr/lib/python2.7/unittest/case.py", line 509, in _baseAssertEqual | |
| raise self.failureException(msg) | |
| AssertionError: datetime.datetime(1985, 4, 12, 23, 20, 50, tzinfo=<iso8601.iso8601.Utc object at 0x1c14110>) != term('TaggedValue(Symbol("inst"), "\'1985-04-12T23:20:50Z")') | |
| ~��+p@�RE���/��@Aedn.tests.test_extended.DecoderTests.test_inst_without_fractional3text/x-traceback; charset="utf8"; language="python" traceback�>��+@TRE���/��@Aedn.tests.test_extended.DecoderTests.test_inst_without_fractionalN3gi�+@CRE���4~�1edn.tests.test_extended.DecoderTests.test_keyword�EH+@CRE���6�(1edn.tests.test_extended.DecoderTests.test_keyword�}���+?RE���7�h.edn.tests.test_extended.DecoderTests.test_list�Y���+?RE���9��.edn.tests.test_extended.DecoderTests.test_list�����+>RE���;-edn.tests.test_extended.DecoderTests.test_map��O�+>RE���A�X-edn.tests.test_extended.DecoderTests.test_map�2���+?RE���B.edn.tests.test_extended.DecoderTests.test_nonek:�&�+?RE���D�.edn.tests.test_extended.DecoderTests.test_none6��,�+@CRE���E( 1edn.tests.test_extended.DecoderTests.test_numbersN��3�+@CRE���G/�1edn.tests.test_extended.DecoderTests.test_numbers@���+@CRE���HH�1edn.tests.test_extended.DecoderTests.test_readers�nJֳ+`BJRE���K�1edn.tests.test_extended.DecoderTests.test_readers3text/x-traceback; charset="utf8"; language="python" tracebackA�Traceback (most recent call last): | |
| File "edn/tests/test_extended.py", line 81, in test_readers | |
| self.assertEqual([u'r', u'a', u'b'], result) | |
| File "/usr/lib/python2.7/unittest/case.py", line 516, in assertEqual | |
| assertion_func(first, second, msg=msg) | |
| File "/usr/lib/python2.7/unittest/case.py", line 509, in _baseAssertEqual | |
| raise self.failureException(msg) | |
| AssertionError: [u'r', u'a', u'b'] != term('TaggedValue(Symbol("foo"), "\'bar")') | |
| ��3�+p@�RE���K�1edn.tests.test_extended.DecoderTests.test_readers3text/x-traceback; charset="utf8"; language="python" traceback | |
| <�M�+@CRE���K�1edn.tests.test_extended.DecoderTests.test_readers�"��+>RE���PWh-edn.tests.test_extended.DecoderTests.test_set�e�+>RE���R^�-edn.tests.test_extended.DecoderTests.test_set-��+@BRE���Sp`0edn.tests.test_extended.DecoderTests.test_stringÒ+@BRE���T�x0edn.tests.test_extended.DecoderTests.test_string$���+@BRE���U��0edn.tests.test_extended.DecoderTests.test_symbol<�+@BRE���W��0edn.tests.test_extended.DecoderTests.test_symbol4�7��+@HRE���X�06edn.tests.test_extended.DecoderTests.test_tagged_value�@�+@HRE���[�x6edn.tests.test_extended.DecoderTests.test_tagged_value�S7��+?RE���\Ҹ.edn.tests.test_extended.DecoderTests.test_uuid�3m�+?RE���_W@.edn.tests.test_extended.DecoderTests.test_uuid�I��+@BRE���`l�0edn.tests.test_extended.DecoderTests.test_vectortJ�+@BRE���b\�0edn.tests.test_extended.DecoderTests.test_vector��B$�+@QRE���c��?edn.tests.test_extended.DumpsTestCase.test_arbitrary_namedtuplen�a�+@QRE���lȨ?edn.tests.test_extended.DumpsTestCase.test_arbitrary_namedtuplej} | |
| �+@DRE���n�2edn.tests.test_extended.DumpsTestCase.test_complex(A��+@DRE����8�2edn.tests.test_extended.DumpsTestCase.test_complexq��+@JRE������8edn.tests.test_extended.DumpsTestCase.test_custom_writer���ɳ+@JRE����^�8edn.tests.test_extended.DumpsTestCase.test_custom_writer�鮝�+@ERE�����P3edn.tests.test_extended.DumpsTestCase.test_datetimeF/���+@ERE������3edn.tests.test_extended.DumpsTestCase.test_datetime� 䠳+@MRE����qH;edn.tests.test_extended.DumpsTestCase.test_datetime_with_tz�̳+@MRE����;edn.tests.test_extended.DumpsTestCase.test_datetime_with_tzP�ϳ+@KRE����l�9edn.tests.test_extended.DumpsTestCase.test_escaped_string���+@KRE����h�9edn.tests.test_extended.DumpsTestCase.test_escaped_string�(�:�+@ARE������/edn.tests.test_extended.DumpsTestCase.test_null�c��+?RE���/edn.tests.test_extended.DumpsTestCase.test_null�<�q�+?RE��� �/edn.tests.test_extended.DumpsTestCase.test_uuid�ZZ�+?RE����8/edn.tests.test_extended.DumpsTestCase.test_uuidi�^�+@HRE���7�7edn.tests.test_extended.EncoderTests.test_custom_writer巐?�+@HRE�����7edn.tests.test_extended.EncoderTests.test_custom_writer�b=��+@CRE���~`2edn.tests.test_extended.EncoderTests.test_datetime�����+@CRE����2edn.tests.test_extended.EncoderTests.test_datetime�+�t�+@BRE���V�1edn.tests.test_extended.EncoderTests.test_keywordq�8�+@BRE����1edn.tests.test_extended.EncoderTests.test_keyword,[���+=RE����H-edn.tests.test_extended.EncoderTests.test_map�����+=RE���̠-edn.tests.test_extended.EncoderTests.test_map�W�+@ORE���8>edn.tests.test_extended.EncoderTests.test_nested_custom_writer�y��+@ORE���~�>edn.tests.test_extended.EncoderTests.test_nested_custom_writer��˳+@FRE�����5edn.tests.test_extended.EncoderTests.test_nested_list�nij�+@FRE���v�5edn.tests.test_extended.EncoderTests.test_nested_list� | |
| $�+@ERE����84edn.tests.test_extended.EncoderTests.test_nested_map�4b��+@ERE���}�4edn.tests.test_extended.EncoderTests.test_nested_map�_��+@ERE�����4edn.tests.test_extended.EncoderTests.test_nested_set�|F��+@ERE�����4edn.tests.test_extended.EncoderTests.test_nested_set1~³+@HRE���ޘ7edn.tests.test_extended.EncoderTests.test_nested_vector�~���+@HRE���*X7edn.tests.test_extended.EncoderTests.test_nested_vector�Lֳ+>RE���C�.edn.tests.test_extended.EncoderTests.test_none��:��+>RE�����.edn.tests.test_extended.EncoderTests.test_none3A��+>RE���@� -edn.tests.test_extended.EncoderTests.test_set-���+>RE���D��-edn.tests.test_extended.EncoderTests.test_set�����+@BRE���E�H0edn.tests.test_extended.EncoderTests.test_string��%�+@BRE���G�x0edn.tests.test_extended.EncoderTests.test_string�V�x�+@BRE���H�0edn.��4�+@BRE���J�0edn.tests.test_extended.EncoderTests.test_symbolS��dz+@HRE���Kx6edn.tests.test_extended.EncoderTests.test_tagged_value����+`ByRE���L��6edn.tests.test_extended.EncoderTests.test_tagged_value3text/x-traceback; charset="utf8"; language="python" tracebackA�Traceback (most recent call last): | |
| File "edn/tests/test_extended.py", line 185, in test_tagged_value | |
| None, encode(TaggedValue(Symbol('foo'), 'bar'))) | |
| File "edn/_extended.py", line 160, in encode | |
| return encoder(obj) | |
| File "edn/_extended.py", line 143, in <lambda> | |
| (tuple, lambda obj: List([encode(x, writers) for x in obj])), | |
| File "/home/jml/src/edn/.env/local/lib/python2.7/site-packages/terml/nodes.py", line 17, in __iter__ | |
| raise NotImplementedError() | |
| NotImplementedError | |
| ��W �+p@�RE���L��6edn.tests.test_extended.EncoderTests.test_tagged_value3text/x-traceback; charset="utf8"; language="python" traceback|�Wm�+@HRE���L��6edn.tes�+@ARE���W�/edn.tests.test_extended.EncoderTests.test_tuple߃�!�+?RE���X�p.edn.tests.test_extended.EncoderTests.test_uuid�;�C�+?RE���[��.edn.tests.test_extended.EncoderTests.test_uuid�b���+@KRE���\��9edn.tests.test_extended.LoadsTestCase.test_custom_defaultt_PJ�+@KRE����09edn.tests.test_extended.LoadsTestCase.test_custom_defaultw�z�+@GRE����nx5edn.tests.test_extended.LoadsTestCase.test_custom_tag�/�m�+`B9RE����(5edn.tests.test_extended.LoadsTestCase.test_custom_tag3text/x-traceback; charset="utf8"; language="python" tracebackA�Traceback (most recent call last): | |
| File "edn/tests/test_extended.py", line 128, in test_custom_tag | |
| self.assertEqual([2, 1], parsed) | |
| File "/usr/lib/python2.7/unittest/case.py", line 516, in assertEqual | |
| assertion_func(first, second, msg=msg) | |
| File "/usr/lib/python2.7/unittest/case.py", line 509, in _baseAssertEqual | |
| raise self.failureException(msg) | |
| AssertionError: [2, 1] != term('TaggedValue(Symbol("foo"), [1, 2])') | |
| �iA��+p@�RE����(5edn.tests.test_extended.LoadsTestCase.test_custom_tag3text/x-traceback; charset="utf8"; language="python" traceback�~�A�+@GRE����(5edn.tests.test_extended.LoadsTestCase.test_custom_tag6��d�+@VRE������@Cedn.tests.test_extended.LoadsTestCase.test_custom_tag_doesnt_mutate�iF�+@VRE���&��@Cedn.tests.test_extended.LoadsTestCase.test_custom_tag_doesnt_mutate�Tz,�+@DRE���(��2edn.tests.test_extended.LoadsTestCase.test_numbers�<���+@DRE���b��2edn.tests.test_extended.LoadsTestCase.test_numbersW��+@FRE���e!�4edn.tests.test_extended.LoadsTestCase.test_structureM��v�+@FRE�����(4edn.tests.test_extended.LoadsTestCase.test_structure��� | |
| ====================================================================== | |
| ERROR: process-returncode | |
| tags: worker-0 | |
| ---------------------------------------------------------------------- | |
| returncode 1 | |
| Ran 1 (+1) tests in 0.000s | |
| FAILED (id=426, failures=1 (+1)) |
Sign up for free
to join this conversation on GitHub.
Already have an account?
Sign in to comment