Created
May 18, 2017 06:38
-
-
Save teslamint/d1b3fa34e6daa09559b8303d50fa2910 to your computer and use it in GitHub Desktop.
php71-libsodium (homebrew/php/php71-libsodium) on macOS 10.12.5 - Homebrew build logs
This file contains bidirectional Unicode text that may be interpreted or compiled differently than what appears below. To review, open the file in an editor that reveals hidden Unicode characters.
Learn more about bidirectional Unicode characters
Homebrew build logs for homebrew/php/php71-libsodium on macOS 10.12.5 | |
Build date: 2017-05-18 15:35:21 |
This file contains bidirectional Unicode text that may be interpreted or compiled differently than what appears below. To review, open the file in an editor that reveals hidden Unicode characters.
Learn more about bidirectional Unicode characters
HOMEBREW_VERSION: 1.2.1-7-g2b726383f1 | |
ORIGIN: https://github.com/Homebrew/brew.git | |
HEAD: 2b726383f1712e5a34627b4db9bed8b7b81973b2 | |
Last commit: 2 days ago | |
Core tap ORIGIN: https://github.com/Homebrew/homebrew-core | |
Core tap HEAD: e956379e4340cdad25b016b49576f9660abfe875 | |
Core tap last commit: 3 weeks ago | |
HOMEBREW_PREFIX: /usr/local | |
HOMEBREW_REPOSITORY: /usr/local/Homebrew | |
HOMEBREW_CELLAR: /usr/local/Cellar | |
HOMEBREW_BOTTLE_DOMAIN: https://homebrew.bintray.com | |
CPU: quad-core 64-bit haswell | |
Homebrew Ruby: 2.0.0-p648 | |
Clang: 8.1 build 802 | |
Git: 2.13.0 => /usr/local/bin/git | |
Perl: /Users/teslamint/perl5/perlbrew/perls/perl-5.23.9/bin/perl => /Users/teslamint/perl5/perlbrew/perls/perl-5.23.9/bin/perl5.23.9 | |
Python: /usr/local/bin/python => /usr/local/Cellar/python/2.7.13/Frameworks/Python.framework/Versions/2.7/bin/python2.7 | |
Ruby: /usr/local/var/rbenv/shims/ruby => /usr/local/var/rbenv/versions/2.2.3/bin/ruby | |
Java: 1.8.0_40, 1.8.0_25, 1.8.0_20, 1.7.0_71, 1.7.0_60, 1.6.0_65-b14-468 | |
macOS: 10.12.5-x86_64 | |
Xcode: 8.3.2 | |
CLT: 8.3.2.0.1.1492020469 | |
X11: 2.7.11 => /opt/X11 |
This file contains bidirectional Unicode text that may be interpreted or compiled differently than what appears below. To review, open the file in an editor that reveals hidden Unicode characters.
Learn more about bidirectional Unicode characters
Please note that these warnings are just used to help the Homebrew maintainers | |
with debugging if you file an issue. If everything you use Homebrew for is | |
working fine: please don't worry and just ignore them. Thanks! | |
Warning: "config" scripts exist outside your system or Homebrew directories. | |
`./configure` scripts often look for *-config scripts to determine if | |
software packages are installed, and what additional flags to use when | |
compiling and linking. | |
Having additional scripts in your path can confuse software installed via | |
Homebrew if the config script overrides a system or Homebrew provided | |
script of the same name. We found the following "config" scripts: | |
/Library/Frameworks/Python.framework/Versions/3.4/bin/pre-commit-validate-config | |
/Library/Frameworks/Python.framework/Versions/3.4/bin/python3-config | |
/Library/Frameworks/Python.framework/Versions/3.4/bin/python3.4-config | |
/Library/Frameworks/Python.framework/Versions/3.4/bin/python3.4m-config | |
Warning: Python is installed at /Library/Frameworks/Python.framework | |
Homebrew only supports building against the System-provided Python or a | |
brewed Python. In particular, Pythons installed to /Library can interfere | |
with other software installs. | |
Warning: Unbrewed dylibs were found in /usr/local/lib. | |
If you didn't put them there on purpose they could cause problems when | |
building Homebrew formulae, and may need to be deleted. | |
Unexpected dylibs: | |
/usr/local/lib/libcapnp-0.5-dev.dylib | |
/usr/local/lib/libcapnp-rpc-0.5-dev.dylib | |
/usr/local/lib/libcapnpc-0.5-dev.dylib | |
/usr/local/lib/libcompress42.dylib | |
/usr/local/lib/libd2xx_table.dylib | |
/usr/local/lib/libhttpd.0.dylib | |
/usr/local/lib/libiCheckKernel.dylib | |
/usr/local/lib/libjson-c.2.dylib | |
/usr/local/lib/libkj-0.5-dev.dylib | |
/usr/local/lib/libkj-async-0.5-dev.dylib | |
/usr/local/lib/libsres.15.dylib | |
/usr/local/lib/libtinfl.dylib | |
/usr/local/lib/libwolfmqtt.1.dylib | |
/usr/local/lib/libykclient.3.dylib | |
/usr/local/lib/libyubikey.0.dylib | |
Warning: Unbrewed header files were found in /usr/local/include. | |
If you didn't put them there on purpose they could cause problems when | |
building Homebrew formulae, and may need to be deleted. | |
Unexpected header files: | |
/usr/local/include/wifidog/httpd.h | |
/usr/local/include/wolfmqtt/mqtt_client.h | |
/usr/local/include/wolfmqtt/mqtt_packet.h | |
/usr/local/include/wolfmqtt/mqtt_socket.h | |
/usr/local/include/wolfmqtt/mqtt_types.h | |
/usr/local/include/wolfmqtt/version.h | |
/usr/local/include/wolfmqtt/visibility.h | |
Warning: Unbrewed .la files were found in /usr/local/lib. | |
If you didn't put them there on purpose they could cause problems when | |
building Homebrew formulae, and may need to be deleted. | |
Unexpected .la files: | |
/usr/local/lib/libbstring.la | |
/usr/local/lib/libcapnp-rpc.la | |
/usr/local/lib/libcapnp.la | |
/usr/local/lib/libcapnpc.la | |
/usr/local/lib/libchilli.la | |
/usr/local/lib/libhttpd.la | |
/usr/local/lib/libjson.la | |
/usr/local/lib/libkj-async.la | |
/usr/local/lib/libkj.la | |
/usr/local/lib/libsres.la | |
/usr/local/lib/libusb-1.0.la | |
/usr/local/lib/libwolfmqtt.la | |
Warning: Unbrewed static libraries were found in /usr/local/lib. | |
If you didn't put them there on purpose they could cause problems when | |
building Homebrew formulae, and may need to be deleted. | |
Unexpected static libraries: | |
/usr/local/lib/libhttpd.a | |
/usr/local/lib/libsres.a | |
Warning: You have unlinked kegs in your Cellar | |
Leaving kegs unlinked can lead to build-trouble and cause brews that depend on | |
those kegs to fail to run properly once built. Run `brew link` on these: | |
android-sdk | |
docker-machine | |
percona-server | |
phantomjs | |
php70 | |
speedtest_cli | |
Warning: Some keg-only formula are linked into the Cellar. | |
Linking a keg-only formula, such as gettext, into the cellar with | |
`brew link <formula>` will cause other formulae to detect them during | |
the `./configure` step. This may cause problems when compiling those | |
other formulae. | |
Binaries provided by keg-only formulae may override system binaries | |
with other strange results. | |
You may wish to `brew unlink` these brews: | |
gettext | |
gnu-getopt | |
srm |
This file contains bidirectional Unicode text that may be interpreted or compiled differently than what appears below. To review, open the file in an editor that reveals hidden Unicode characters.
Learn more about bidirectional Unicode characters
homebrew/php/php71-libsodium |
This file contains bidirectional Unicode text that may be interpreted or compiled differently than what appears below. To review, open the file in an editor that reveals hidden Unicode characters.
Learn more about bidirectional Unicode characters
Formula: php71-libsodium | |
Tap: homebrew/php | |
Path: /usr/local/Homebrew/Library/Taps/homebrew/homebrew-php/Formula/php71-libsodium.rb |
This file contains bidirectional Unicode text that may be interpreted or compiled differently than what appears below. To review, open the file in an editor that reveals hidden Unicode characters.
Learn more about bidirectional Unicode characters
2017-05-18 15:35:10 +0900 | |
/usr/local/opt/php71/bin/phpize | |
Configuring for: | |
PHP Api Version: 20160303 | |
Zend Module Api No: 20160303 | |
Zend Extension Api No: 320160303 |
This file contains bidirectional Unicode text that may be interpreted or compiled differently than what appears below. To review, open the file in an editor that reveals hidden Unicode characters.
Learn more about bidirectional Unicode characters
2017-05-18 15:35:11 +0900 | |
./configure | |
--prefix=/usr/local/Cellar/php71-libsodium/1.0.6 | |
--with-php-config=/usr/local/opt/php71/bin/php-config | |
checking for grep that handles long lines and -e... /usr/bin/grep | |
checking for egrep... /usr/bin/grep -E | |
checking for a sed that does not truncate output... /usr/local/Homebrew/Library/Homebrew/shims/super/sed | |
checking whether the C compiler works... yes | |
checking for C compiler default output file name... a.out | |
checking for suffix of executables... | |
checking whether we are cross compiling... no | |
checking for suffix of object files... o | |
checking whether we are using the GNU C compiler... yes | |
checking whether clang accepts -g... yes | |
checking for clang option to accept ISO C89... none needed | |
checking how to run the C preprocessor... clang -E | |
checking for icc... no | |
checking for suncc... no | |
checking whether clang and cc understand -c and -o together... yes | |
checking for system library directory... lib | |
checking if compiler supports -R... no | |
checking if compiler supports -Wl,-rpath,... yes | |
checking build system type... x86_64-apple-darwin16.6.0 | |
checking host system type... x86_64-apple-darwin16.6.0 | |
checking target system type... x86_64-apple-darwin16.6.0 | |
checking for PHP prefix... /usr/local/Cellar/php71/7.1.5_17 | |
checking for PHP includes... -I/usr/local/Cellar/php71/7.1.5_17/include/php -I/usr/local/Cellar/php71/7.1.5_17/include/php/main -I/usr/local/Cellar/php71/7.1.5_17/include/php/TSRM -I/usr/local/Cellar/php71/7.1.5_17/include/php/Zend -I/usr/local/Cellar/php71/7.1.5_17/include/php/ext -I/usr/local/Cellar/php71/7.1.5_17/include/php/ext/date/lib | |
checking for PHP extension directory... /usr/local/Cellar/php71/7.1.5_17/lib/php/extensions/no-debug-non-zts-20160303 | |
checking for PHP installed headers prefix... /usr/local/Cellar/php71/7.1.5_17/include/php | |
checking if debug is enabled... no | |
checking if zts is enabled... no | |
checking for re2c... no | |
configure: WARNING: You will need re2c 0.13.4 or later if you want to regenerate PHP parsers. | |
checking for gawk... no | |
checking for nawk... no | |
checking for awk... awk | |
checking if awk is broken... no | |
checking for libsodium support... yes, shared | |
checking for libsodium files in default path... found in /usr/local | |
checking for crypto_pwhash_scryptsalsa208sha256 in -lsodium... no | |
configure: error: wrong libsodium lib version or lib not found | |
HOMEBREW_VERSION: 1.2.1-7-g2b726383f1 | |
ORIGIN: https://github.com/Homebrew/brew.git | |
HEAD: 2b726383f1712e5a34627b4db9bed8b7b81973b2 | |
Last commit: 2 days ago | |
Core tap ORIGIN: https://github.com/Homebrew/homebrew-core | |
Core tap HEAD: e956379e4340cdad25b016b49576f9660abfe875 | |
Core tap last commit: 3 weeks ago | |
HOMEBREW_PREFIX: /usr/local | |
HOMEBREW_REPOSITORY: /usr/local/Homebrew | |
HOMEBREW_CELLAR: /usr/local/Cellar | |
HOMEBREW_BOTTLE_DOMAIN: https://homebrew.bintray.com | |
CPU: quad-core 64-bit haswell | |
Homebrew Ruby: 2.0.0-p648 | |
Clang: 8.1 build 802 | |
Git: 2.11.0 => /Applications/Xcode.app/Contents/Developer/usr/bin/git | |
Perl: /usr/bin/perl | |
Python: /usr/bin/python | |
Ruby: /usr/bin/ruby => /System/Library/Frameworks/Ruby.framework/Versions/2.0/usr/bin/ruby | |
Java: 1.8.0_40, 1.8.0_25, 1.8.0_20, 1.7.0_71, 1.7.0_60, 1.6.0_65-b14-468 | |
macOS: 10.12.5-x86_64 | |
Xcode: 8.3.2 | |
CLT: 8.3.2.0.1.1492020469 | |
X11: 2.7.11 => /opt/X11 | |
HOMEBREW_CC: clang | |
HOMEBREW_CXX: clang++ | |
SDKROOT: /Applications/Xcode.app/Contents/Developer/Platforms/MacOSX.platform/Developer/SDKs/MacOSX10.12.sdk | |
MAKEFLAGS: -j4 | |
CMAKE_PREFIX_PATH: /usr/local/opt/gettext:/usr/local/opt/icu4c:/usr/local/opt/libxml2:/usr/local/opt/readline:/usr/local/opt/openssl:/usr/local | |
CMAKE_INCLUDE_PATH: /System/Library/Frameworks/OpenGL.framework/Versions/Current/Headers | |
CMAKE_LIBRARY_PATH: /System/Library/Frameworks/OpenGL.framework/Versions/Current/Libraries | |
MACOSX_DEPLOYMENT_TARGET: 10.12 | |
PKG_CONFIG_PATH: /usr/local/opt/libpng/lib/pkgconfig:/usr/local/opt/freetype/lib/pkgconfig:/usr/local/opt/icu4c/lib/pkgconfig:/usr/local/opt/libxml2/lib/pkgconfig:/usr/local/opt/openssl/lib/pkgconfig:/usr/local/opt/libsodium/lib/pkgconfig | |
PKG_CONFIG_LIBDIR: /usr/lib/pkgconfig:/usr/local/Homebrew/Library/Homebrew/os/mac/pkgconfig/10.12 | |
ACLOCAL_PATH: /usr/local/opt/gettext/share/aclocal:/usr/local/opt/libxml2/share/aclocal:/usr/local/share/aclocal | |
PATH: /usr/local/Homebrew/Library/Homebrew/shims/super:/usr/local/opt/autoconf/bin:/usr/local/opt/libpng/bin:/usr/local/opt/freetype/bin:/usr/local/opt/gettext/bin:/usr/local/opt/icu4c/bin:/usr/local/opt/jpeg/bin:/usr/local/opt/libxml2/bin:/usr/local/opt/unixodbc/bin:/usr/local/opt/openssl/bin:/usr/local/opt/php71/bin:/usr/bin:/bin:/usr/sbin:/sbin |
This file contains bidirectional Unicode text that may be interpreted or compiled differently than what appears below. To review, open the file in an editor that reveals hidden Unicode characters.
Learn more about bidirectional Unicode characters
clang called with: --version | |
superenv added: -pipe -Os -march=native -isystem/usr/local/include -isystem/System/Library/Frameworks/OpenGL.framework/Versions/Current/Headers -I/usr/local/opt/gettext/include -I/usr/local/opt/icu4c/include -I/usr/local/opt/libxml2/include -I/usr/local/opt/readline/include -I/usr/local/opt/openssl/include -L/usr/local/opt/gettext/lib -L/usr/local/opt/icu4c/lib -L/usr/local/opt/libxml2/lib -L/usr/local/opt/readline/lib -L/usr/local/opt/openssl/lib -L/usr/local/lib -L/System/Library/Frameworks/OpenGL.framework/Versions/Current/Libraries -Wl,-headerpad_max_install_names | |
superenv executed: clang -pipe -Os -march=native --version -isystem/usr/local/include -isystem/System/Library/Frameworks/OpenGL.framework/Versions/Current/Headers -I/usr/local/opt/gettext/include -I/usr/local/opt/icu4c/include -I/usr/local/opt/libxml2/include -I/usr/local/opt/readline/include -I/usr/local/opt/openssl/include -L/usr/local/opt/gettext/lib -L/usr/local/opt/icu4c/lib -L/usr/local/opt/libxml2/lib -L/usr/local/opt/readline/lib -L/usr/local/opt/openssl/lib -L/usr/local/lib -L/System/Library/Frameworks/OpenGL.framework/Versions/Current/Libraries -Wl,-headerpad_max_install_names | |
clang called with: -v | |
superenv executed: clang -v | |
clang called with: -V | |
superenv added: -pipe -Os -march=native -isystem/usr/local/include -isystem/System/Library/Frameworks/OpenGL.framework/Versions/Current/Headers -I/usr/local/opt/gettext/include -I/usr/local/opt/icu4c/include -I/usr/local/opt/libxml2/include -I/usr/local/opt/readline/include -I/usr/local/opt/openssl/include -L/usr/local/opt/gettext/lib -L/usr/local/opt/icu4c/lib -L/usr/local/opt/libxml2/lib -L/usr/local/opt/readline/lib -L/usr/local/opt/openssl/lib -L/usr/local/lib -L/System/Library/Frameworks/OpenGL.framework/Versions/Current/Libraries -Wl,-headerpad_max_install_names | |
superenv executed: clang -pipe -Os -march=native -V -isystem/usr/local/include -isystem/System/Library/Frameworks/OpenGL.framework/Versions/Current/Headers -I/usr/local/opt/gettext/include -I/usr/local/opt/icu4c/include -I/usr/local/opt/libxml2/include -I/usr/local/opt/readline/include -I/usr/local/opt/openssl/include -L/usr/local/opt/gettext/lib -L/usr/local/opt/icu4c/lib -L/usr/local/opt/libxml2/lib -L/usr/local/opt/readline/lib -L/usr/local/opt/openssl/lib -L/usr/local/lib -L/System/Library/Frameworks/OpenGL.framework/Versions/Current/Libraries -Wl,-headerpad_max_install_names | |
clang called with: -qversion | |
superenv added: -pipe -Os -march=native -isystem/usr/local/include -isystem/System/Library/Frameworks/OpenGL.framework/Versions/Current/Headers -I/usr/local/opt/gettext/include -I/usr/local/opt/icu4c/include -I/usr/local/opt/libxml2/include -I/usr/local/opt/readline/include -I/usr/local/opt/openssl/include -L/usr/local/opt/gettext/lib -L/usr/local/opt/icu4c/lib -L/usr/local/opt/libxml2/lib -L/usr/local/opt/readline/lib -L/usr/local/opt/openssl/lib -L/usr/local/lib -L/System/Library/Frameworks/OpenGL.framework/Versions/Current/Libraries -Wl,-headerpad_max_install_names | |
superenv executed: clang -pipe -Os -march=native -qversion -isystem/usr/local/include -isystem/System/Library/Frameworks/OpenGL.framework/Versions/Current/Headers -I/usr/local/opt/gettext/include -I/usr/local/opt/icu4c/include -I/usr/local/opt/libxml2/include -I/usr/local/opt/readline/include -I/usr/local/opt/openssl/include -L/usr/local/opt/gettext/lib -L/usr/local/opt/icu4c/lib -L/usr/local/opt/libxml2/lib -L/usr/local/opt/readline/lib -L/usr/local/opt/openssl/lib -L/usr/local/lib -L/System/Library/Frameworks/OpenGL.framework/Versions/Current/Libraries -Wl,-headerpad_max_install_names | |
clang called with: conftest.c | |
superenv added: -pipe -Os -march=native -isystem/usr/local/include -isystem/System/Library/Frameworks/OpenGL.framework/Versions/Current/Headers -I/usr/local/opt/gettext/include -I/usr/local/opt/icu4c/include -I/usr/local/opt/libxml2/include -I/usr/local/opt/readline/include -I/usr/local/opt/openssl/include -L/usr/local/opt/gettext/lib -L/usr/local/opt/icu4c/lib -L/usr/local/opt/libxml2/lib -L/usr/local/opt/readline/lib -L/usr/local/opt/openssl/lib -L/usr/local/lib -L/System/Library/Frameworks/OpenGL.framework/Versions/Current/Libraries -Wl,-headerpad_max_install_names | |
superenv executed: clang -pipe -Os -march=native conftest.c -isystem/usr/local/include -isystem/System/Library/Frameworks/OpenGL.framework/Versions/Current/Headers -I/usr/local/opt/gettext/include -I/usr/local/opt/icu4c/include -I/usr/local/opt/libxml2/include -I/usr/local/opt/readline/include -I/usr/local/opt/openssl/include -L/usr/local/opt/gettext/lib -L/usr/local/opt/icu4c/lib -L/usr/local/opt/libxml2/lib -L/usr/local/opt/readline/lib -L/usr/local/opt/openssl/lib -L/usr/local/lib -L/System/Library/Frameworks/OpenGL.framework/Versions/Current/Libraries -Wl,-headerpad_max_install_names | |
clang called with: -o conftest conftest.c | |
superenv added: -pipe -Os -march=native -isystem/usr/local/include -isystem/System/Library/Frameworks/OpenGL.framework/Versions/Current/Headers -I/usr/local/opt/gettext/include -I/usr/local/opt/icu4c/include -I/usr/local/opt/libxml2/include -I/usr/local/opt/readline/include -I/usr/local/opt/openssl/include -L/usr/local/opt/gettext/lib -L/usr/local/opt/icu4c/lib -L/usr/local/opt/libxml2/lib -L/usr/local/opt/readline/lib -L/usr/local/opt/openssl/lib -L/usr/local/lib -L/System/Library/Frameworks/OpenGL.framework/Versions/Current/Libraries -Wl,-headerpad_max_install_names | |
superenv executed: clang -pipe -Os -march=native -o conftest conftest.c -isystem/usr/local/include -isystem/System/Library/Frameworks/OpenGL.framework/Versions/Current/Headers -I/usr/local/opt/gettext/include -I/usr/local/opt/icu4c/include -I/usr/local/opt/libxml2/include -I/usr/local/opt/readline/include -I/usr/local/opt/openssl/include -L/usr/local/opt/gettext/lib -L/usr/local/opt/icu4c/lib -L/usr/local/opt/libxml2/lib -L/usr/local/opt/readline/lib -L/usr/local/opt/openssl/lib -L/usr/local/lib -L/System/Library/Frameworks/OpenGL.framework/Versions/Current/Libraries -Wl,-headerpad_max_install_names | |
clang called with: -o conftest conftest.c | |
superenv added: -pipe -Os -march=native -isystem/usr/local/include -isystem/System/Library/Frameworks/OpenGL.framework/Versions/Current/Headers -I/usr/local/opt/gettext/include -I/usr/local/opt/icu4c/include -I/usr/local/opt/libxml2/include -I/usr/local/opt/readline/include -I/usr/local/opt/openssl/include -L/usr/local/opt/gettext/lib -L/usr/local/opt/icu4c/lib -L/usr/local/opt/libxml2/lib -L/usr/local/opt/readline/lib -L/usr/local/opt/openssl/lib -L/usr/local/lib -L/System/Library/Frameworks/OpenGL.framework/Versions/Current/Libraries -Wl,-headerpad_max_install_names | |
superenv executed: clang -pipe -Os -march=native -o conftest conftest.c -isystem/usr/local/include -isystem/System/Library/Frameworks/OpenGL.framework/Versions/Current/Headers -I/usr/local/opt/gettext/include -I/usr/local/opt/icu4c/include -I/usr/local/opt/libxml2/include -I/usr/local/opt/readline/include -I/usr/local/opt/openssl/include -L/usr/local/opt/gettext/lib -L/usr/local/opt/icu4c/lib -L/usr/local/opt/libxml2/lib -L/usr/local/opt/readline/lib -L/usr/local/opt/openssl/lib -L/usr/local/lib -L/System/Library/Frameworks/OpenGL.framework/Versions/Current/Libraries -Wl,-headerpad_max_install_names | |
clang called with: -c conftest.c | |
superenv added: -pipe -Os -march=native -isystem/usr/local/include -isystem/System/Library/Frameworks/OpenGL.framework/Versions/Current/Headers -I/usr/local/opt/gettext/include -I/usr/local/opt/icu4c/include -I/usr/local/opt/libxml2/include -I/usr/local/opt/readline/include -I/usr/local/opt/openssl/include | |
superenv executed: clang -pipe -Os -march=native -c conftest.c -isystem/usr/local/include -isystem/System/Library/Frameworks/OpenGL.framework/Versions/Current/Headers -I/usr/local/opt/gettext/include -I/usr/local/opt/icu4c/include -I/usr/local/opt/libxml2/include -I/usr/local/opt/readline/include -I/usr/local/opt/openssl/include | |
clang called with: -c conftest.c | |
superenv added: -pipe -Os -march=native -isystem/usr/local/include -isystem/System/Library/Frameworks/OpenGL.framework/Versions/Current/Headers -I/usr/local/opt/gettext/include -I/usr/local/opt/icu4c/include -I/usr/local/opt/libxml2/include -I/usr/local/opt/readline/include -I/usr/local/opt/openssl/include | |
superenv executed: clang -pipe -Os -march=native -c conftest.c -isystem/usr/local/include -isystem/System/Library/Frameworks/OpenGL.framework/Versions/Current/Headers -I/usr/local/opt/gettext/include -I/usr/local/opt/icu4c/include -I/usr/local/opt/libxml2/include -I/usr/local/opt/readline/include -I/usr/local/opt/openssl/include | |
clang called with: -c -g conftest.c | |
superenv added: -pipe -Os -march=native -isystem/usr/local/include -isystem/System/Library/Frameworks/OpenGL.framework/Versions/Current/Headers -I/usr/local/opt/gettext/include -I/usr/local/opt/icu4c/include -I/usr/local/opt/libxml2/include -I/usr/local/opt/readline/include -I/usr/local/opt/openssl/include | |
superenv executed: clang -pipe -Os -march=native -c -g conftest.c -isystem/usr/local/include -isystem/System/Library/Frameworks/OpenGL.framework/Versions/Current/Headers -I/usr/local/opt/gettext/include -I/usr/local/opt/icu4c/include -I/usr/local/opt/libxml2/include -I/usr/local/opt/readline/include -I/usr/local/opt/openssl/include | |
clang called with: -c -g -O2 conftest.c | |
superenv added: -pipe -Os -march=native -isystem/usr/local/include -isystem/System/Library/Frameworks/OpenGL.framework/Versions/Current/Headers -I/usr/local/opt/gettext/include -I/usr/local/opt/icu4c/include -I/usr/local/opt/libxml2/include -I/usr/local/opt/readline/include -I/usr/local/opt/openssl/include | |
superenv executed: clang -pipe -Os -march=native -c -g -O2 conftest.c -isystem/usr/local/include -isystem/System/Library/Frameworks/OpenGL.framework/Versions/Current/Headers -I/usr/local/opt/gettext/include -I/usr/local/opt/icu4c/include -I/usr/local/opt/libxml2/include -I/usr/local/opt/readline/include -I/usr/local/opt/openssl/include | |
clang called with: -E conftest.c | |
superenv added: -isystem/usr/local/include -isystem/System/Library/Frameworks/OpenGL.framework/Versions/Current/Headers -I/usr/local/opt/gettext/include -I/usr/local/opt/icu4c/include -I/usr/local/opt/libxml2/include -I/usr/local/opt/readline/include -I/usr/local/opt/openssl/include | |
superenv executed: clang -E conftest.c -isystem/usr/local/include -isystem/System/Library/Frameworks/OpenGL.framework/Versions/Current/Headers -I/usr/local/opt/gettext/include -I/usr/local/opt/icu4c/include -I/usr/local/opt/libxml2/include -I/usr/local/opt/readline/include -I/usr/local/opt/openssl/include | |
clang called with: -E conftest.c | |
superenv added: -isystem/usr/local/include -isystem/System/Library/Frameworks/OpenGL.framework/Versions/Current/Headers -I/usr/local/opt/gettext/include -I/usr/local/opt/icu4c/include -I/usr/local/opt/libxml2/include -I/usr/local/opt/readline/include -I/usr/local/opt/openssl/include | |
superenv executed: clang -E conftest.c -isystem/usr/local/include -isystem/System/Library/Frameworks/OpenGL.framework/Versions/Current/Headers -I/usr/local/opt/gettext/include -I/usr/local/opt/icu4c/include -I/usr/local/opt/libxml2/include -I/usr/local/opt/readline/include -I/usr/local/opt/openssl/include | |
clang called with: -E conftest.c | |
superenv added: -isystem/usr/local/include -isystem/System/Library/Frameworks/OpenGL.framework/Versions/Current/Headers -I/usr/local/opt/gettext/include -I/usr/local/opt/icu4c/include -I/usr/local/opt/libxml2/include -I/usr/local/opt/readline/include -I/usr/local/opt/openssl/include | |
superenv executed: clang -E conftest.c -isystem/usr/local/include -isystem/System/Library/Frameworks/OpenGL.framework/Versions/Current/Headers -I/usr/local/opt/gettext/include -I/usr/local/opt/icu4c/include -I/usr/local/opt/libxml2/include -I/usr/local/opt/readline/include -I/usr/local/opt/openssl/include | |
clang called with: -E conftest.c | |
superenv added: -isystem/usr/local/include -isystem/System/Library/Frameworks/OpenGL.framework/Versions/Current/Headers -I/usr/local/opt/gettext/include -I/usr/local/opt/icu4c/include -I/usr/local/opt/libxml2/include -I/usr/local/opt/readline/include -I/usr/local/opt/openssl/include | |
superenv executed: clang -E conftest.c -isystem/usr/local/include -isystem/System/Library/Frameworks/OpenGL.framework/Versions/Current/Headers -I/usr/local/opt/gettext/include -I/usr/local/opt/icu4c/include -I/usr/local/opt/libxml2/include -I/usr/local/opt/readline/include -I/usr/local/opt/openssl/include | |
clang called with: -E conftest.c | |
superenv added: -isystem/usr/local/include -isystem/System/Library/Frameworks/OpenGL.framework/Versions/Current/Headers -I/usr/local/opt/gettext/include -I/usr/local/opt/icu4c/include -I/usr/local/opt/libxml2/include -I/usr/local/opt/readline/include -I/usr/local/opt/openssl/include | |
superenv executed: clang -E conftest.c -isystem/usr/local/include -isystem/System/Library/Frameworks/OpenGL.framework/Versions/Current/Headers -I/usr/local/opt/gettext/include -I/usr/local/opt/icu4c/include -I/usr/local/opt/libxml2/include -I/usr/local/opt/readline/include -I/usr/local/opt/openssl/include | |
clang called with: -E conftest.c | |
superenv added: -isystem/usr/local/include -isystem/System/Library/Frameworks/OpenGL.framework/Versions/Current/Headers -I/usr/local/opt/gettext/include -I/usr/local/opt/icu4c/include -I/usr/local/opt/libxml2/include -I/usr/local/opt/readline/include -I/usr/local/opt/openssl/include | |
superenv executed: clang -E conftest.c -isystem/usr/local/include -isystem/System/Library/Frameworks/OpenGL.framework/Versions/Current/Headers -I/usr/local/opt/gettext/include -I/usr/local/opt/icu4c/include -I/usr/local/opt/libxml2/include -I/usr/local/opt/readline/include -I/usr/local/opt/openssl/include | |
clang called with: -c conftest.c -o conftest2.o | |
superenv added: -pipe -Os -march=native -isystem/usr/local/include -isystem/System/Library/Frameworks/OpenGL.framework/Versions/Current/Headers -I/usr/local/opt/gettext/include -I/usr/local/opt/icu4c/include -I/usr/local/opt/libxml2/include -I/usr/local/opt/readline/include -I/usr/local/opt/openssl/include | |
superenv executed: clang -pipe -Os -march=native -c conftest.c -o conftest2.o -isystem/usr/local/include -isystem/System/Library/Frameworks/OpenGL.framework/Versions/Current/Headers -I/usr/local/opt/gettext/include -I/usr/local/opt/icu4c/include -I/usr/local/opt/libxml2/include -I/usr/local/opt/readline/include -I/usr/local/opt/openssl/include | |
clang called with: -c conftest.c -o conftest2.o | |
superenv added: -pipe -Os -march=native -isystem/usr/local/include -isystem/System/Library/Frameworks/OpenGL.framework/Versions/Current/Headers -I/usr/local/opt/gettext/include -I/usr/local/opt/icu4c/include -I/usr/local/opt/libxml2/include -I/usr/local/opt/readline/include -I/usr/local/opt/openssl/include | |
superenv executed: clang -pipe -Os -march=native -c conftest.c -o conftest2.o -isystem/usr/local/include -isystem/System/Library/Frameworks/OpenGL.framework/Versions/Current/Headers -I/usr/local/opt/gettext/include -I/usr/local/opt/icu4c/include -I/usr/local/opt/libxml2/include -I/usr/local/opt/readline/include -I/usr/local/opt/openssl/include | |
cc called with: -c conftest.c | |
superenv added: -pipe -Os -march=native -isystem/usr/local/include -isystem/System/Library/Frameworks/OpenGL.framework/Versions/Current/Headers -I/usr/local/opt/gettext/include -I/usr/local/opt/icu4c/include -I/usr/local/opt/libxml2/include -I/usr/local/opt/readline/include -I/usr/local/opt/openssl/include | |
superenv executed: clang -pipe -Os -march=native -c conftest.c -isystem/usr/local/include -isystem/System/Library/Frameworks/OpenGL.framework/Versions/Current/Headers -I/usr/local/opt/gettext/include -I/usr/local/opt/icu4c/include -I/usr/local/opt/libxml2/include -I/usr/local/opt/readline/include -I/usr/local/opt/openssl/include | |
cc called with: -c conftest.c -o conftest2.o | |
superenv added: -pipe -Os -march=native -isystem/usr/local/include -isystem/System/Library/Frameworks/OpenGL.framework/Versions/Current/Headers -I/usr/local/opt/gettext/include -I/usr/local/opt/icu4c/include -I/usr/local/opt/libxml2/include -I/usr/local/opt/readline/include -I/usr/local/opt/openssl/include | |
superenv executed: clang -pipe -Os -march=native -c conftest.c -o conftest2.o -isystem/usr/local/include -isystem/System/Library/Frameworks/OpenGL.framework/Versions/Current/Headers -I/usr/local/opt/gettext/include -I/usr/local/opt/icu4c/include -I/usr/local/opt/libxml2/include -I/usr/local/opt/readline/include -I/usr/local/opt/openssl/include | |
cc called with: -c conftest.c -o conftest2.o | |
superenv added: -pipe -Os -march=native -isystem/usr/local/include -isystem/System/Library/Frameworks/OpenGL.framework/Versions/Current/Headers -I/usr/local/opt/gettext/include -I/usr/local/opt/icu4c/include -I/usr/local/opt/libxml2/include -I/usr/local/opt/readline/include -I/usr/local/opt/openssl/include | |
superenv executed: clang -pipe -Os -march=native -c conftest.c -o conftest2.o -isystem/usr/local/include -isystem/System/Library/Frameworks/OpenGL.framework/Versions/Current/Headers -I/usr/local/opt/gettext/include -I/usr/local/opt/icu4c/include -I/usr/local/opt/libxml2/include -I/usr/local/opt/readline/include -I/usr/local/opt/openssl/include | |
clang called with: -o conftest -g -O2 conftest.c -R /usr/lib | |
superenv added: -pipe -Os -march=native -isystem/usr/local/include -isystem/System/Library/Frameworks/OpenGL.framework/Versions/Current/Headers -I/usr/local/opt/gettext/include -I/usr/local/opt/icu4c/include -I/usr/local/opt/libxml2/include -I/usr/local/opt/readline/include -I/usr/local/opt/openssl/include -L/usr/local/opt/gettext/lib -L/usr/local/opt/icu4c/lib -L/usr/local/opt/libxml2/lib -L/usr/local/opt/readline/lib -L/usr/local/opt/openssl/lib -L/usr/local/lib -L/System/Library/Frameworks/OpenGL.framework/Versions/Current/Libraries -Wl,-headerpad_max_install_names | |
superenv executed: clang -pipe -Os -march=native -o conftest -g -O2 conftest.c -R /usr/lib -isystem/usr/local/include -isystem/System/Library/Frameworks/OpenGL.framework/Versions/Current/Headers -I/usr/local/opt/gettext/include -I/usr/local/opt/icu4c/include -I/usr/local/opt/libxml2/include -I/usr/local/opt/readline/include -I/usr/local/opt/openssl/include -L/usr/local/opt/gettext/lib -L/usr/local/opt/icu4c/lib -L/usr/local/opt/libxml2/lib -L/usr/local/opt/readline/lib -L/usr/local/opt/openssl/lib -L/usr/local/lib -L/System/Library/Frameworks/OpenGL.framework/Versions/Current/Libraries -Wl,-headerpad_max_install_names | |
clang called with: -o conftest -g -O2 conftest.c -Wl,-rpath,/usr/lib | |
superenv added: -pipe -Os -march=native -isystem/usr/local/include -isystem/System/Library/Frameworks/OpenGL.framework/Versions/Current/Headers -I/usr/local/opt/gettext/include -I/usr/local/opt/icu4c/include -I/usr/local/opt/libxml2/include -I/usr/local/opt/readline/include -I/usr/local/opt/openssl/include -L/usr/local/opt/gettext/lib -L/usr/local/opt/icu4c/lib -L/usr/local/opt/libxml2/lib -L/usr/local/opt/readline/lib -L/usr/local/opt/openssl/lib -L/usr/local/lib -L/System/Library/Frameworks/OpenGL.framework/Versions/Current/Libraries -Wl,-headerpad_max_install_names | |
superenv executed: clang -pipe -Os -march=native -o conftest -g -O2 conftest.c -Wl,-rpath,/usr/lib -isystem/usr/local/include -isystem/System/Library/Frameworks/OpenGL.framework/Versions/Current/Headers -I/usr/local/opt/gettext/include -I/usr/local/opt/icu4c/include -I/usr/local/opt/libxml2/include -I/usr/local/opt/readline/include -I/usr/local/opt/openssl/include -L/usr/local/opt/gettext/lib -L/usr/local/opt/icu4c/lib -L/usr/local/opt/libxml2/lib -L/usr/local/opt/readline/lib -L/usr/local/opt/openssl/lib -L/usr/local/lib -L/System/Library/Frameworks/OpenGL.framework/Versions/Current/Libraries -Wl,-headerpad_max_install_names | |
clang called with: -E -I/usr/local/Cellar/php71/7.1.5_17/include/php conftest.c | |
superenv added: -isystem/usr/local/include -isystem/System/Library/Frameworks/OpenGL.framework/Versions/Current/Headers -I/usr/local/opt/gettext/include -I/usr/local/opt/icu4c/include -I/usr/local/opt/libxml2/include -I/usr/local/opt/readline/include -I/usr/local/opt/openssl/include | |
superenv executed: clang -E -I/usr/local/Cellar/php71/7.1.5_17/include/php conftest.c -isystem/usr/local/include -isystem/System/Library/Frameworks/OpenGL.framework/Versions/Current/Headers -I/usr/local/opt/gettext/include -I/usr/local/opt/icu4c/include -I/usr/local/opt/libxml2/include -I/usr/local/opt/readline/include -I/usr/local/opt/openssl/include | |
clang called with: -E -I/usr/local/Cellar/php71/7.1.5_17/include/php conftest.c | |
superenv added: -isystem/usr/local/include -isystem/System/Library/Frameworks/OpenGL.framework/Versions/Current/Headers -I/usr/local/opt/gettext/include -I/usr/local/opt/icu4c/include -I/usr/local/opt/libxml2/include -I/usr/local/opt/readline/include -I/usr/local/opt/openssl/include | |
superenv executed: clang -E -I/usr/local/Cellar/php71/7.1.5_17/include/php conftest.c -isystem/usr/local/include -isystem/System/Library/Frameworks/OpenGL.framework/Versions/Current/Headers -I/usr/local/opt/gettext/include -I/usr/local/opt/icu4c/include -I/usr/local/opt/libxml2/include -I/usr/local/opt/readline/include -I/usr/local/opt/openssl/include | |
clang called with: -o conftest -g -O2 -Wl,-rpath,/usr/local/lib -L/usr/local/lib conftest.c -lsodium | |
superenv added: -pipe -Os -march=native -isystem/usr/local/include -isystem/System/Library/Frameworks/OpenGL.framework/Versions/Current/Headers -I/usr/local/opt/gettext/include -I/usr/local/opt/icu4c/include -I/usr/local/opt/libxml2/include -I/usr/local/opt/readline/include -I/usr/local/opt/openssl/include -L/usr/local/opt/gettext/lib -L/usr/local/opt/icu4c/lib -L/usr/local/opt/libxml2/lib -L/usr/local/opt/readline/lib -L/usr/local/opt/openssl/lib -L/System/Library/Frameworks/OpenGL.framework/Versions/Current/Libraries -Wl,-headerpad_max_install_names | |
superenv executed: clang -pipe -Os -march=native -o conftest -g -O2 -Wl,-rpath,/usr/local/lib -L/usr/local/lib conftest.c -lsodium -isystem/usr/local/include -isystem/System/Library/Frameworks/OpenGL.framework/Versions/Current/Headers -I/usr/local/opt/gettext/include -I/usr/local/opt/icu4c/include -I/usr/local/opt/libxml2/include -I/usr/local/opt/readline/include -I/usr/local/opt/openssl/include -L/usr/local/opt/gettext/lib -L/usr/local/opt/icu4c/lib -L/usr/local/opt/libxml2/lib -L/usr/local/opt/readline/lib -L/usr/local/opt/openssl/lib -L/usr/local/lib -L/System/Library/Frameworks/OpenGL.framework/Versions/Current/Libraries -Wl,-headerpad_max_install_names | |
This file contains bidirectional Unicode text that may be interpreted or compiled differently than what appears below. To review, open the file in an editor that reveals hidden Unicode characters.
Learn more about bidirectional Unicode characters
This file contains any messages produced by compilers while | |
running configure, to aid debugging if configure makes a mistake. | |
It was created by configure, which was | |
generated by GNU Autoconf 2.69. Invocation command line was | |
$ ./configure --prefix=/usr/local/Cellar/php71-libsodium/1.0.6 --with-php-config=/usr/local/opt/php71/bin/php-config | |
## --------- ## | |
## Platform. ## | |
## --------- ## | |
hostname = tesl9-mbp.local | |
uname -m = x86_64 | |
uname -r = 16.6.0 | |
uname -s = Darwin | |
uname -v = Darwin Kernel Version 16.6.0: Fri Apr 14 16:21:16 PDT 2017; root:xnu-3789.60.24~6/RELEASE_X86_64 | |
/usr/bin/uname -p = i386 | |
/bin/uname -X = unknown | |
/bin/arch = unknown | |
/usr/bin/arch -k = unknown | |
/usr/convex/getsysinfo = unknown | |
/usr/bin/hostinfo = Mach kernel version: | |
Darwin Kernel Version 16.6.0: Fri Apr 14 16:21:16 PDT 2017; root:xnu-3789.60.24~6/RELEASE_X86_64 | |
Kernel configured for up to 4 processors. | |
2 processors are physically available. | |
4 processors are logically available. | |
Processor type: x86_64h (Intel x86-64h Haswell) | |
Processors active: 0 1 2 3 | |
Primary memory available: 16.00 gigabytes | |
Default processor set: 546 tasks, 3253 threads, 4 processors | |
Load average: 3.36, Mach factor: 0.95 | |
/bin/machine = unknown | |
/usr/bin/oslevel = unknown | |
/bin/universe = unknown | |
PATH: /usr/local/Homebrew/Library/Homebrew/shims/super | |
PATH: /usr/local/opt/autoconf/bin | |
PATH: /usr/local/opt/libpng/bin | |
PATH: /usr/local/opt/freetype/bin | |
PATH: /usr/local/opt/gettext/bin | |
PATH: /usr/local/opt/icu4c/bin | |
PATH: /usr/local/opt/jpeg/bin | |
PATH: /usr/local/opt/libxml2/bin | |
PATH: /usr/local/opt/unixodbc/bin | |
PATH: /usr/local/opt/openssl/bin | |
PATH: /usr/local/opt/php71/bin | |
PATH: /usr/bin | |
PATH: /bin | |
PATH: /usr/sbin | |
PATH: /sbin | |
## ----------- ## | |
## Core tests. ## | |
## ----------- ## | |
configure:2294: checking for grep that handles long lines and -e | |
configure:2352: result: /usr/bin/grep | |
configure:2357: checking for egrep | |
configure:2419: result: /usr/bin/grep -E | |
configure:2424: checking for a sed that does not truncate output | |
configure:2478: result: /usr/local/Homebrew/Library/Homebrew/shims/super/sed | |
configure:2673: checking for C compiler version | |
configure:2682: clang --version >&5 | |
Apple LLVM version 8.1.0 (clang-802.0.42) | |
Target: x86_64-apple-darwin16.6.0 | |
Thread model: posix | |
InstalledDir: /Applications/Xcode.app/Contents/Developer/Toolchains/XcodeDefault.xctoolchain/usr/bin | |
configure:2693: $? = 0 | |
configure:2682: clang -v >&5 | |
Apple LLVM version 8.1.0 (clang-802.0.42) | |
Target: x86_64-apple-darwin16.6.0 | |
Thread model: posix | |
InstalledDir: /Applications/Xcode.app/Contents/Developer/Toolchains/XcodeDefault.xctoolchain/usr/bin | |
configure:2693: $? = 0 | |
configure:2682: clang -V >&5 | |
clang: error: unsupported option '-V -isystem/usr/local/include' | |
configure:2693: $? = 1 | |
configure:2682: clang -qversion >&5 | |
clang: error: unknown argument: '-qversion' | |
configure:2693: $? = 1 | |
configure:2713: checking whether the C compiler works | |
configure:2735: clang conftest.c >&5 | |
configure:2739: $? = 0 | |
configure:2787: result: yes | |
configure:2790: checking for C compiler default output file name | |
configure:2792: result: a.out | |
configure:2798: checking for suffix of executables | |
configure:2805: clang -o conftest conftest.c >&5 | |
configure:2809: $? = 0 | |
configure:2831: result: | |
configure:2853: checking whether we are cross compiling | |
configure:2861: clang -o conftest conftest.c >&5 | |
configure:2865: $? = 0 | |
configure:2872: ./conftest | |
configure:2876: $? = 0 | |
configure:2891: result: no | |
configure:2896: checking for suffix of object files | |
configure:2918: clang -c conftest.c >&5 | |
configure:2922: $? = 0 | |
configure:2943: result: o | |
configure:2947: checking whether we are using the GNU C compiler | |
configure:2966: clang -c conftest.c >&5 | |
configure:2966: $? = 0 | |
configure:2975: result: yes | |
configure:2984: checking whether clang accepts -g | |
configure:3004: clang -c -g conftest.c >&5 | |
configure:3004: $? = 0 | |
configure:3045: result: yes | |
configure:3062: checking for clang option to accept ISO C89 | |
configure:3125: clang -c -g -O2 conftest.c >&5 | |
configure:3125: $? = 0 | |
configure:3138: result: none needed | |
configure:3164: checking how to run the C preprocessor | |
configure:3195: clang -E conftest.c | |
configure:3195: $? = 0 | |
configure:3209: clang -E conftest.c | |
conftest.c:9:10: fatal error: 'ac_nonexistent.h' file not found | |
#include <ac_nonexistent.h> | |
^ | |
1 error generated. | |
configure:3209: $? = 1 | |
configure: failed program was: | |
| /* confdefs.h */ | |
| #define PACKAGE_NAME "" | |
| #define PACKAGE_TARNAME "" | |
| #define PACKAGE_VERSION "" | |
| #define PACKAGE_STRING "" | |
| #define PACKAGE_BUGREPORT "" | |
| #define PACKAGE_URL "" | |
| /* end confdefs.h. */ | |
| #include <ac_nonexistent.h> | |
configure:3234: result: clang -E | |
configure:3254: clang -E conftest.c | |
configure:3254: $? = 0 | |
configure:3268: clang -E conftest.c | |
conftest.c:9:10: fatal error: 'ac_nonexistent.h' file not found | |
#include <ac_nonexistent.h> | |
^ | |
1 error generated. | |
configure:3268: $? = 1 | |
configure: failed program was: | |
| /* confdefs.h */ | |
| #define PACKAGE_NAME "" | |
| #define PACKAGE_TARNAME "" | |
| #define PACKAGE_VERSION "" | |
| #define PACKAGE_STRING "" | |
| #define PACKAGE_BUGREPORT "" | |
| #define PACKAGE_URL "" | |
| /* end confdefs.h. */ | |
| #include <ac_nonexistent.h> | |
configure:3299: checking for icc | |
configure:3308: result: no | |
configure:3322: checking for suncc | |
configure:3331: result: no | |
configure:3346: checking whether clang and cc understand -c and -o together | |
configure:3377: clang -c conftest.c -o conftest2.o >&5 | |
configure:3381: $? = 0 | |
configure:3387: clang -c conftest.c -o conftest2.o >&5 | |
configure:3391: $? = 0 | |
configure:3402: cc -c conftest.c >&5 | |
configure:3406: $? = 0 | |
configure:3414: cc -c conftest.c -o conftest2.o >&5 | |
configure:3418: $? = 0 | |
configure:3424: cc -c conftest.c -o conftest2.o >&5 | |
configure:3428: $? = 0 | |
configure:3446: result: yes | |
configure:3460: checking for system library directory | |
configure:3475: result: lib | |
configure:3482: checking if compiler supports -R | |
configure:3501: clang -o conftest -g -O2 conftest.c -R /usr/lib >&5 | |
warning: unknown remark option '-R' [-Wunknown-warning-option] | |
1 warning generated. | |
ld: can't map file, errno=22 file '/Applications/Xcode.app/Contents/Developer/Platforms/MacOSX.platform/Developer/SDKs/MacOSX10.12.sdk/usr/lib' for architecture x86_64 | |
clang: error: linker command failed with exit code 1 (use -v to see invocation) | |
configure:3501: $? = 1 | |
configure: failed program was: | |
| /* confdefs.h */ | |
| #define PACKAGE_NAME "" | |
| #define PACKAGE_TARNAME "" | |
| #define PACKAGE_VERSION "" | |
| #define PACKAGE_STRING "" | |
| #define PACKAGE_BUGREPORT "" | |
| #define PACKAGE_URL "" | |
| /* end confdefs.h. */ | |
| | |
| int | |
| main () | |
| { | |
| | |
| ; | |
| return 0; | |
| } | |
configure:3511: result: no | |
configure:3516: checking if compiler supports -Wl,-rpath, | |
configure:3535: clang -o conftest -g -O2 conftest.c -Wl,-rpath,/usr/lib >&5 | |
configure:3535: $? = 0 | |
configure:3545: result: yes | |
configure:3590: checking build system type | |
configure:3604: result: x86_64-apple-darwin16.6.0 | |
configure:3624: checking host system type | |
configure:3637: result: x86_64-apple-darwin16.6.0 | |
configure:3657: checking target system type | |
configure:3670: result: x86_64-apple-darwin16.6.0 | |
configure:3773: checking for PHP prefix | |
configure:3775: result: /usr/local/Cellar/php71/7.1.5_17 | |
configure:3777: checking for PHP includes | |
configure:3779: result: -I/usr/local/Cellar/php71/7.1.5_17/include/php -I/usr/local/Cellar/php71/7.1.5_17/include/php/main -I/usr/local/Cellar/php71/7.1.5_17/include/php/TSRM -I/usr/local/Cellar/php71/7.1.5_17/include/php/Zend -I/usr/local/Cellar/php71/7.1.5_17/include/php/ext -I/usr/local/Cellar/php71/7.1.5_17/include/php/ext/date/lib | |
configure:3781: checking for PHP extension directory | |
configure:3783: result: /usr/local/Cellar/php71/7.1.5_17/lib/php/extensions/no-debug-non-zts-20160303 | |
configure:3785: checking for PHP installed headers prefix | |
configure:3787: result: /usr/local/Cellar/php71/7.1.5_17/include/php | |
configure:3790: checking if debug is enabled | |
configure:3816: result: no | |
configure:3819: checking if zts is enabled | |
configure:3845: result: no | |
configure:3916: checking for re2c | |
configure:3946: result: no | |
configure:3971: WARNING: You will need re2c 0.13.4 or later if you want to regenerate PHP parsers. | |
configure:3985: checking for gawk | |
configure:4016: result: no | |
configure:3985: checking for nawk | |
configure:4016: result: no | |
configure:3985: checking for awk | |
configure:4002: found /usr/bin/awk | |
configure:4013: result: awk | |
configure:4036: checking if awk is broken | |
configure:4043: result: no | |
configure:4057: checking for libsodium support | |
configure:4097: result: yes, shared | |
configure:4109: checking for libsodium files in default path | |
configure:4114: result: found in /usr/local | |
configure:4259: checking for crypto_pwhash_scryptsalsa208sha256 in -lsodium | |
configure:4284: clang -o conftest -g -O2 -Wl,-rpath,/usr/local/lib -L/usr/local/lib conftest.c -lsodium >&5 | |
ld: library not found for -lsodium | |
clang: error: linker command failed with exit code 1 (use -v to see invocation) | |
configure:4284: $? = 1 | |
configure: failed program was: | |
| /* confdefs.h */ | |
| #define PACKAGE_NAME "" | |
| #define PACKAGE_TARNAME "" | |
| #define PACKAGE_VERSION "" | |
| #define PACKAGE_STRING "" | |
| #define PACKAGE_BUGREPORT "" | |
| #define PACKAGE_URL "" | |
| /* end confdefs.h. */ | |
| | |
| /* Override any GCC internal prototype to avoid an error. | |
| Use char because int might match the return type of a GCC | |
| builtin and then its argument prototype would still apply. */ | |
| #ifdef __cplusplus | |
| extern "C" | |
| #endif | |
| char crypto_pwhash_scryptsalsa208sha256 (); | |
| int | |
| main () | |
| { | |
| return crypto_pwhash_scryptsalsa208sha256 (); | |
| ; | |
| return 0; | |
| } | |
configure:4294: result: no | |
configure:4409: error: wrong libsodium lib version or lib not found | |
## ---------------- ## | |
## Cache variables. ## | |
## ---------------- ## | |
ac_cv_build=x86_64-apple-darwin16.6.0 | |
ac_cv_c_compiler_gnu=yes | |
ac_cv_env_CC_set=set | |
ac_cv_env_CC_value=clang | |
ac_cv_env_CFLAGS_set= | |
ac_cv_env_CFLAGS_value= | |
ac_cv_env_CPPFLAGS_set= | |
ac_cv_env_CPPFLAGS_value= | |
ac_cv_env_CPP_set= | |
ac_cv_env_CPP_value= | |
ac_cv_env_LDFLAGS_set= | |
ac_cv_env_LDFLAGS_value= | |
ac_cv_env_LIBS_set= | |
ac_cv_env_LIBS_value= | |
ac_cv_env_build_alias_set= | |
ac_cv_env_build_alias_value= | |
ac_cv_env_host_alias_set= | |
ac_cv_env_host_alias_value= | |
ac_cv_env_target_alias_set= | |
ac_cv_env_target_alias_value= | |
ac_cv_host=x86_64-apple-darwin16.6.0 | |
ac_cv_lib_sodium___crypto_pwhash_scryptsalsa208sha256=no | |
ac_cv_objext=o | |
ac_cv_path_EGREP='/usr/bin/grep -E' | |
ac_cv_path_GREP=/usr/bin/grep | |
ac_cv_prog_AWK=awk | |
ac_cv_prog_CPP='clang -E' | |
ac_cv_prog_cc_c89= | |
ac_cv_prog_cc_clang_c_o=yes | |
ac_cv_prog_cc_g=yes | |
ac_cv_target=x86_64-apple-darwin16.6.0 | |
lt_cv_path_SED=/usr/local/Homebrew/Library/Homebrew/shims/super/sed | |
php_cv_cc_dashr=no | |
php_cv_cc_rpath=yes | |
## ----------------- ## | |
## Output variables. ## | |
## ----------------- ## | |
AR='' | |
AWK='awk' | |
CC='clang' | |
CFLAGS='-g -O2' | |
CONFIGURE_COMMAND=' '\''./configure'\'' '\''--prefix=/usr/local/Cellar/php71-libsodium/1.0.6'\'' '\''--with-php-config=/usr/local/opt/php71/bin/php-config'\''' | |
CONFIGURE_OPTIONS=' '\''--prefix=/usr/local/Cellar/php71-libsodium/1.0.6'\'' '\''--with-php-config=/usr/local/opt/php71/bin/php-config'\''' | |
CPP='clang -E' | |
CPPFLAGS='' | |
DEFS='' | |
DSYMUTIL='' | |
ECHO='/bin/echo' | |
ECHO_C='\c' | |
ECHO_N='' | |
ECHO_T='' | |
EGREP='/usr/bin/grep -E' | |
EXEEXT='' | |
GREP='/usr/bin/grep' | |
LDFLAGS='' | |
LIBOBJS='' | |
LIBS='' | |
LIBTOOL='' | |
LN_S='' | |
LTLIBOBJS='' | |
NMEDIT='' | |
OBJEXT='o' | |
PACKAGE_BUGREPORT='' | |
PACKAGE_NAME='' | |
PACKAGE_STRING='' | |
PACKAGE_TARNAME='' | |
PACKAGE_URL='' | |
PACKAGE_VERSION='' | |
PATH_SEPARATOR=':' | |
RANLIB='' | |
RE2C='exit 0;' | |
SED='/usr/local/Homebrew/Library/Homebrew/shims/super/sed' | |
SHELL='/bin/sh' | |
SHLIB_DL_SUFFIX_NAME='so' | |
SHLIB_SUFFIX_NAME='dylib' | |
STRIP='' | |
ac_ct_CC='' | |
bindir='${exec_prefix}/bin' | |
build='x86_64-apple-darwin16.6.0' | |
build_alias='' | |
build_cpu='x86_64' | |
build_os='darwin16.6.0' | |
build_vendor='apple' | |
datadir='${datarootdir}' | |
datarootdir='${prefix}/share' | |
docdir='${datarootdir}/doc/${PACKAGE}' | |
dvidir='${docdir}' | |
exec_prefix='NONE' | |
host='x86_64-apple-darwin16.6.0' | |
host_alias='x86_64-apple-darwin16.6.0' | |
host_cpu='x86_64' | |
host_os='darwin16.6.0' | |
host_vendor='apple' | |
htmldir='${docdir}' | |
includedir='${prefix}/include' | |
infodir='${datarootdir}/info' | |
libdir='${exec_prefix}/lib' | |
libexecdir='${exec_prefix}/libexec' | |
localedir='${datarootdir}/locale' | |
localstatedir='${prefix}/var' | |
mandir='${datarootdir}/man' | |
oldincludedir='/usr/include' | |
pdfdir='${docdir}' | |
prefix='/usr/local/Cellar/php71/7.1.5_17' | |
program_transform_name='s,x,x,' | |
psdir='${docdir}' | |
sbindir='${exec_prefix}/sbin' | |
sharedstatedir='${prefix}/com' | |
sysconfdir='${prefix}/etc' | |
target='x86_64-apple-darwin16.6.0' | |
target_alias='' | |
target_cpu='x86_64' | |
target_os='darwin16.6.0' | |
target_vendor='apple' | |
## ----------- ## | |
## confdefs.h. ## | |
## ----------- ## | |
/* confdefs.h */ | |
#define PACKAGE_NAME "" | |
#define PACKAGE_TARNAME "" | |
#define PACKAGE_VERSION "" | |
#define PACKAGE_STRING "" | |
#define PACKAGE_BUGREPORT "" | |
#define PACKAGE_URL "" | |
configure: exit 1 |
Sign up for free
to join this conversation on GitHub.
Already have an account?
Sign in to comment