Created
November 15, 2022 22:34
-
-
Save vonovak/7dcef431731a5e175a84f1767ba6ccfe to your computer and use it in GitHub Desktop.
document-picker android build issue
This file contains bidirectional Unicode text that may be interpreted or compiled differently than what appears below. To review, open the file in an editor that reveals hidden Unicode characters.
Learn more about bidirectional Unicode characters
info Starting JS server... | |
info Detected architectures arm64-v8a | |
info Installing the app... | |
> Task :react-native-gradle-plugin:compileKotlin UP-TO-DATE | |
> Task :react-native-gradle-plugin:compileJava NO-SOURCE | |
> Task :react-native-gradle-plugin:pluginDescriptors UP-TO-DATE | |
> Task :react-native-gradle-plugin:processResources UP-TO-DATE | |
> Task :react-native-gradle-plugin:classes UP-TO-DATE | |
> Task :react-native-gradle-plugin:inspectClassesForKotlinIC UP-TO-DATE | |
> Task :react-native-gradle-plugin:jar UP-TO-DATE | |
> Task :ReactAndroid:extractNativeDependencies UP-TO-DATE | |
> Task :ReactAndroid:buildCodegenCLI SKIPPED | |
> Task :ReactAndroid:generateCodegenSchemaFromJavaScript UP-TO-DATE | |
> Task :ReactAndroid:generateCodegenArtifactsFromSchema UP-TO-DATE | |
> Task :ReactAndroid:createNativeDepsDirectories UP-TO-DATE | |
> Task :ReactAndroid:downloadBoost UP-TO-DATE | |
Download https://boostorg.jfrog.io/artifactory/main/release/1.76.0/source/boost_1_76_0.tar.gz | |
> Task :ReactAndroid:downloadDoubleConversion UP-TO-DATE | |
Download https://github.com/google/double-conversion/archive/v1.1.6.tar.gz | |
> Task :ReactAndroid:prepareBoost UP-TO-DATE | |
> Task :ReactAndroid:prepareDoubleConversion UP-TO-DATE | |
> Task :ReactAndroid:downloadFmt UP-TO-DATE | |
Download https://github.com/fmtlib/fmt/archive/6.2.1.tar.gz | |
> Task :ReactAndroid:downloadFolly UP-TO-DATE | |
Download https://github.com/facebook/folly/archive/v2021.07.22.00.tar.gz | |
> Task :ReactAndroid:prepareFmt UP-TO-DATE | |
> Task :ReactAndroid:prepareFolly UP-TO-DATE | |
> Task :ReactAndroid:downloadGlog UP-TO-DATE | |
Download https://github.com/google/glog/archive/v0.3.5.tar.gz | |
> Task :ReactAndroid:prepareJSC UP-TO-DATE | |
> Task :ReactAndroid:prepareGlog UP-TO-DATE | |
> Task :ReactAndroid:downloadLibevent UP-TO-DATE | |
Download https://github.com/libevent/libevent/releases/download/release-2.1.12-stable/libevent-2.1.12-stable.tar.gz | |
> Task :ReactAndroid:hermes-engine:downloadHermes UP-TO-DATE | |
Download https://github.com/facebook/hermes/tarball/hermes-2022-09-14-RNv0.70.1-2a6b111ab289b55d7b78b5fdf105f466ba270fd7 | |
> Task :ReactAndroid:prepareLibevent UP-TO-DATE | |
> Task :ReactAndroid:preBuild UP-TO-DATE | |
> Task :ReactAndroid:hermes-engine:unzipHermes UP-TO-DATE | |
> Task :ReactAndroid:hermes-engine:configureBuildForHermes | |
-- Threads enabled. | |
-- Doxygen disabled. | |
-- Go bindings disabled. | |
-- Found ld64 - /Applications/Xcode.app/Contents/Developer/Toolchains/XcodeDefault.xctoolchain/usr/bin/ld | |
-- Could NOT find Python module pygments | |
-- Could NOT find Python module pygments.lexers.c_cpp | |
-- Could NOT find Python module yaml | |
-- CMAKE_HOST_SYSTEM_NAME = Darwin | |
-- CMAKE_SYSTEM_NAME = Darwin | |
-- HERMES_APPLE_TARGET_PLATFORM = | |
-- CMAKE_CROSSCOMPILING = FALSE | |
-- Configuring done | |
-- Generating done | |
-- Build files have been written to: /Users/vojta/_dev/_own/document-picker/node_modules/react-native/ReactAndroid/hermes-engine/build/hermes | |
> Task :ReactAndroid:hermes-engine:buildHermes | |
[ 10%] Built target zip | |
[ 10%] Built target dtoa | |
[ 10%] Built target LLVHDemangle | |
[ 36%] Built target LLVHSupport | |
[ 40%] Built target hermesPlatformUnicode | |
[ 40%] Built target hermesFrontEndDefs | |
[ 50%] Built target hermesOptimizer | |
[ 50%] Built target hermesRegex | |
[ 63%] Built target hermesSupport | |
[ 63%] Built target hermesADT | |
[ 66%] Built target hermesFlowParser | |
[ 66%] Built target hermesInst | |
[ 70%] Built target hermesAST | |
[ 70%] Built target hermesAST2JS | |
[ 73%] Built target hermesParser | |
[ 76%] Built target hermesSourceMap | |
[ 83%] Built target hermesFrontend | |
[ 83%] Built target hermesBackend | |
[ 96%] Built target hermesHBCBackend | |
[100%] Built target hermesCompilerDriver | |
[100%] Built target hermesc | |
> Task :ReactAndroid:hermes-engine:prepareHeadersForPrefab UP-TO-DATE | |
> Task :ReactAndroid:hermes-engine:preBuild | |
> Task :ReactAndroid:hermes-engine:configureCMakeRelease[arm64-v8a] | |
> Task :ReactAndroid:hermes-engine:generateJsonModelDebug | |
> Task :ReactAndroid:hermes-engine:preDebugBuild | |
> Task :ReactAndroid:hermes-engine:prefabDebugConfigurePackage UP-TO-DATE | |
> Task :ReactAndroid:configureCMakeDebug[arm64-v8a] | |
> Task :ReactAndroid:hermes-engine:buildCMakeRelease[arm64-v8a][libhermes] | |
> Task :ReactAndroid:hermes-engine:externalNativeBuildDebug | |
> Task :ReactAndroid:hermes-engine:prefabDebugPackage UP-TO-DATE | |
> Task :ReactAndroid:buildCMakeDebug[arm64-v8a][fabricjni,hermes-executor-debug,etc] | |
C/C++: ninja: Entering directory `/Users/vojta/_dev/_own/document-picker/node_modules/react-native/ReactAndroid/.cxx/Debug/3d5q5820/arm64-v8a' | |
C/C++: /Users/vojta/_dev/_own/document-picker/node_modules/react-native/ReactAndroid/build/generated/source/codegen/jni/rncore-generated.cpp:17:164: error: too few arguments to function call, expected 7, have 6 | |
C/C++: /Users/vojta/_dev/_own/document-picker/node_modules/react-native/ReactCommon/react/nativemodule/core/platform/android/ReactCommon/JavaTurboModule.h:47:3: note: 'invokeJavaMethod' declared here | |
C/C++: /Users/vojta/_dev/_own/document-picker/node_modules/react-native/ReactAndroid/build/generated/source/codegen/jni/rncore-generated.cpp:21:168: error: too few arguments to function call, expected 7, have 6 | |
C/C++: /Users/vojta/_dev/_own/document-picker/node_modules/react-native/ReactCommon/react/nativemodule/core/platform/android/ReactCommon/JavaTurboModule.h:47:3: note: 'invokeJavaMethod' declared here | |
C/C++: /Users/vojta/_dev/_own/document-picker/node_modules/react-native/ReactAndroid/build/generated/source/codegen/jni/rncore-generated.cpp:25:172: error: too few arguments to function call, expected 7, have 6 | |
C/C++: /Users/vojta/_dev/_own/document-picker/node_modules/react-native/ReactCommon/react/nativemodule/core/platform/android/ReactCommon/JavaTurboModule.h:47:3: note: 'invokeJavaMethod' declared here | |
C/C++: /Users/vojta/_dev/_own/document-picker/node_modules/react-native/ReactAndroid/build/generated/source/codegen/jni/rncore-generated.cpp:29:129: error: too few arguments to function call, expected 7, have 6 | |
C/C++: /Users/vojta/_dev/_own/document-picker/node_modules/react-native/ReactCommon/react/nativemodule/core/platform/android/ReactCommon/JavaTurboModule.h:47:3: note: 'invokeJavaMethod' declared here | |
C/C++: /Users/vojta/_dev/_own/document-picker/node_modules/react-native/ReactAndroid/build/generated/source/codegen/jni/rncore-generated.cpp:33:149: error: too few arguments to function call, expected 7, have 6 | |
C/C++: /Users/vojta/_dev/_own/document-picker/node_modules/react-native/ReactCommon/react/nativemodule/core/platform/android/ReactCommon/JavaTurboModule.h:47:3: note: 'invokeJavaMethod' declared here | |
C/C++: /Users/vojta/_dev/_own/document-picker/node_modules/react-native/ReactAndroid/build/generated/source/codegen/jni/rncore-generated.cpp:37:171: error: too few arguments to function call, expected 7, have 6 | |
C/C++: /Users/vojta/_dev/_own/document-picker/node_modules/react-native/ReactCommon/react/nativemodule/core/platform/android/ReactCommon/JavaTurboModule.h:47:3: note: 'invokeJavaMethod' declared here | |
C/C++: /Users/vojta/_dev/_own/document-picker/node_modules/react-native/ReactAndroid/build/generated/source/codegen/jni/rncore-generated.cpp:50:202: error: too few arguments to function call, expected 7, have 6 | |
C/C++: /Users/vojta/_dev/_own/document-picker/node_modules/react-native/ReactCommon/react/nativemodule/core/platform/android/ReactCommon/JavaTurboModule.h:47:3: note: 'invokeJavaMethod' declared here | |
C/C++: /Users/vojta/_dev/_own/document-picker/node_modules/react-native/ReactAndroid/build/generated/source/codegen/jni/rncore-generated.cpp:54:203: error: too few arguments to function call, expected 7, have 6 | |
C/C++: /Users/vojta/_dev/_own/document-picker/node_modules/react-native/ReactCommon/react/nativemodule/core/platform/android/ReactCommon/JavaTurboModule.h:47:3: note: 'invokeJavaMethod' declared here | |
C/C++: /Users/vojta/_dev/_own/document-picker/node_modules/react-native/ReactAndroid/build/generated/source/codegen/jni/rncore-generated.cpp:58:206: error: too few arguments to function call, expected 7, have 6 | |
C/C++: /Users/vojta/_dev/_own/document-picker/node_modules/react-native/ReactCommon/react/nativemodule/core/platform/android/ReactCommon/JavaTurboModule.h:47:3: note: 'invokeJavaMethod' declared here | |
C/C++: /Users/vojta/_dev/_own/document-picker/node_modules/react-native/ReactAndroid/build/generated/source/codegen/jni/rncore-generated.cpp:62:206: error: too few arguments to function call, expected 7, have 6 | |
C/C++: /Users/vojta/_dev/_own/document-picker/node_modules/react-native/ReactCommon/react/nativemodule/core/platform/android/ReactCommon/JavaTurboModule.h:47:3: note: 'invokeJavaMethod' declared here | |
C/C++: /Users/vojta/_dev/_own/document-picker/node_modules/react-native/ReactAndroid/build/generated/source/codegen/jni/rncore-generated.cpp:66:221: error: too few arguments to function call, expected 7, have 6 | |
C/C++: /Users/vojta/_dev/_own/document-picker/node_modules/react-native/ReactCommon/react/nativemodule/core/platform/android/ReactCommon/JavaTurboModule.h:47:3: note: 'invokeJavaMethod' declared here | |
C/C++: /Users/vojta/_dev/_own/document-picker/node_modules/react-native/ReactAndroid/build/generated/source/codegen/jni/rncore-generated.cpp:70:212: error: too few arguments to function call, expected 7, have 6 | |
C/C++: /Users/vojta/_dev/_own/document-picker/node_modules/react-native/ReactCommon/react/nativemodule/core/platform/android/ReactCommon/JavaTurboModule.h:47:3: note: 'invokeJavaMethod' declared here | |
C/C++: /Users/vojta/_dev/_own/document-picker/node_modules/react-native/ReactAndroid/build/generated/source/codegen/jni/rncore-generated.cpp:74:203: error: too few arguments to function call, expected 7, have 6 | |
C/C++: /Users/vojta/_dev/_own/document-picker/node_modules/react-native/ReactCommon/react/nativemodule/core/platform/android/ReactCommon/JavaTurboModule.h:47:3: note: 'invokeJavaMethod' declared here | |
C/C++: /Users/vojta/_dev/_own/document-picker/node_modules/react-native/ReactAndroid/build/generated/source/codegen/jni/rncore-generated.cpp:78:184: error: too few arguments to function call, expected 7, have 6 | |
C/C++: /Users/vojta/_dev/_own/document-picker/node_modules/react-native/ReactCommon/react/nativemodule/core/platform/android/ReactCommon/JavaTurboModule.h:47:3: note: 'invokeJavaMethod' declared here | |
C/C++: /Users/vojta/_dev/_own/document-picker/node_modules/react-native/ReactAndroid/build/generated/source/codegen/jni/rncore-generated.cpp:82:129: error: too few arguments to function call, expected 7, have 6 | |
C/C++: /Users/vojta/_dev/_own/document-picker/node_modules/react-native/ReactCommon/react/nativemodule/core/platform/android/ReactCommon/JavaTurboModule.h:47:3: note: 'invokeJavaMethod' declared here | |
C/C++: /Users/vojta/_dev/_own/document-picker/node_modules/react-native/ReactAndroid/build/generated/source/codegen/jni/rncore-generated.cpp:86:149: error: too few arguments to function call, expected 7, have 6 | |
C/C++: /Users/vojta/_dev/_own/document-picker/node_modules/react-native/ReactCommon/react/nativemodule/core/platform/android/ReactCommon/JavaTurboModule.h:47:3: note: 'invokeJavaMethod' declared here | |
C/C++: /Users/vojta/_dev/_own/document-picker/node_modules/react-native/ReactAndroid/build/generated/source/codegen/jni/rncore-generated.cpp:90:199: error: too few arguments to function call, expected 7, have 6 | |
C/C++: /Users/vojta/_dev/_own/document-picker/node_modules/react-native/ReactCommon/react/nativemodule/core/platform/android/ReactCommon/JavaTurboModule.h:47:3: note: 'invokeJavaMethod' declared here | |
C/C++: /Users/vojta/_dev/_own/document-picker/node_modules/react-native/ReactAndroid/build/generated/source/codegen/jni/rncore-generated.cpp:110:208: error: too few arguments to function call, expected 7, have 6 | |
C/C++: /Users/vojta/_dev/_own/document-picker/node_modules/react-native/ReactCommon/react/nativemodule/core/platform/android/ReactCommon/JavaTurboModule.h:47:3: note: 'invokeJavaMethod' declared here | |
C/C++: /Users/vojta/_dev/_own/document-picker/node_modules/react-native/ReactAndroid/build/generated/source/codegen/jni/rncore-generated.cpp:114:249: error: too few arguments to function call, expected 7, have 6 | |
C/C++: /Users/vojta/_dev/_own/document-picker/node_modules/react-native/ReactCommon/react/nativemodule/core/platform/android/ReactCommon/JavaTurboModule.h:47:3: note: 'invokeJavaMethod' declared here | |
> Task :ReactAndroid:buildCMakeDebug[arm64-v8a][fabricjni,hermes-executor-debug,etc] FAILED | |
33 actionable tasks: 7 executed, 26 up-to-date | |
CMake Deprecation Warning at CMakeLists.txt:42 (cmake_policy): | |
The OLD behavior for policy CMP0026 will be removed from a future version | |
of CMake. | |
The cmake-policies(7) manual explains that the OLD behaviors of all | |
policies are deprecated and that a policy should be set to OLD only under | |
specific short-term circumstances. Projects should be ported to the NEW | |
behavior and not rely on setting a policy to OLD. | |
FAILURE: Build failed with an exception. | |
* What went wrong: | |
Execution failed for task ':ReactAndroid:buildCMakeDebug[arm64-v8a][fabricjni,hermes-executor-debug,etc]'. | |
> Build command failed. | |
Error while executing process /Users/vojta/Library/Android/sdk/cmake/3.18.1/bin/ninja with arguments {-C /Users/vojta/_dev/_own/document-picker/node_modules/react-native/ReactAndroid/.cxx/Debug/3d5q5820/arm64-v8a fabricjni hermes-executor-debug jscexecutor jsijniprofiler reactnativeblob reactnativejni reactperfloggerjni turbomodulejsijni} | |
ninja: Entering directory `/Users/vojta/_dev/_own/document-picker/node_modules/react-native/ReactAndroid/.cxx/Debug/3d5q5820/arm64-v8a' | |
[0/2] Re-checking globbed directories... | |
[1/167] Building CXX object ReactCommon/react/renderer/components/text/CMakeFiles/rrc_text.dir/RawTextShadowNode.cpp.o | |
[2/167] Building CXX object ReactCommon/react/renderer/components/unimplementedview/CMakeFiles/rrc_unimplementedview.dir/UnimplementedViewProps.cpp.o | |
[3/167] Building CXX object ReactCommon/react/renderer/components/text/CMakeFiles/rrc_text.dir/TextProps.cpp.o | |
[4/167] Building CXX object ReactCommon/react/renderer/components/text/CMakeFiles/rrc_text.dir/TextShadowNode.cpp.o | |
[5/167] Building CXX object ReactCommon/react/renderer/components/text/CMakeFiles/rrc_text.dir/RawTextProps.cpp.o | |
[6/167] Building CXX object ReactCommon/react/renderer/components/text/CMakeFiles/rrc_text.dir/BaseTextShadowNode.cpp.o | |
[7/167] Building CXX object ReactCommon/react/renderer/imagemanager/CMakeFiles/react_render_imagemanager.dir/ImageResponse.cpp.o | |
[8/167] Building CXX object ReactCommon/react/renderer/debug/CMakeFiles/react_render_debug.dir/DebugStringConvertibleItem.cpp.o | |
[9/167] Building CXX object ReactCommon/react/renderer/components/text/CMakeFiles/rrc_text.dir/ParagraphEventEmitter.cpp.o | |
[10/167] Building CXX object ReactCommon/react/renderer/imagemanager/CMakeFiles/react_render_imagemanager.dir/ImageResponseObserverCoordinator.cpp.o | |
[11/167] Building CXX object ReactCommon/react/renderer/components/text/CMakeFiles/rrc_text.dir/ParagraphProps.cpp.o | |
[12/167] Building CXX object ReactCommon/react/renderer/components/text/CMakeFiles/rrc_text.dir/BaseTextProps.cpp.o | |
[13/167] Building CXX object ReactCommon/react/renderer/components/unimplementedview/CMakeFiles/rrc_unimplementedview.dir/UnimplementedViewComponentDescriptor.cpp.o | |
[14/167] Building CXX object ReactCommon/react/renderer/components/text/CMakeFiles/rrc_text.dir/ParagraphState.cpp.o | |
[15/167] Building CXX object ReactCommon/react/renderer/debug/CMakeFiles/react_render_debug.dir/DebugStringConvertible.cpp.o | |
[16/167] Building CXX object build/generated/source/codegen/jni/CMakeFiles/react_codegen_rncore.dir/rncore-generated.cpp.o | |
FAILED: build/generated/source/codegen/jni/CMakeFiles/react_codegen_rncore.dir/rncore-generated.cpp.o | |
/Users/vojta/Library/Android/sdk/ndk/21.4.7075529/toolchains/llvm/prebuilt/darwin-x86_64/bin/clang++ --target=aarch64-none-linux-android21 --gcc-toolchain=/Users/vojta/Library/Android/sdk/ndk/21.4.7075529/toolchains/llvm/prebuilt/darwin-x86_64 --sysroot=/Users/vojta/Library/Android/sdk/ndk/21.4.7075529/toolchains/llvm/prebuilt/darwin-x86_64/sysroot -Dreact_codegen_rncore_EXPORTS -I/Users/vojta/_dev/_own/document-picker/node_modules/react-native/ReactAndroid/build/generated/source/codegen/jni/. -I/Users/vojta/_dev/_own/document-picker/node_modules/react-native/ReactAndroid/build/generated/source/codegen/jni/react/renderer/components/rncore -I/Users/vojta/_dev/_own/document-picker/node_modules/react-native/ReactAndroid/build/third-party-ndk/folly/. -I/Users/vojta/_dev/_own/document-picker/node_modules/react-native/ReactAndroid/build/third-party-ndk/glog/exported -I/Users/vojta/_dev/_own/document-picker/node_modules/react-native/ReactAndroid/build/third-party-ndk/double-conversion/. -I/Users/vojta/_dev/_own/document-picker/node_modules/react-native/ReactAndroid/build/third-party-ndk/boost/boost_1_76_0 -I/Users/vojta/_dev/_own/document-picker/node_modules/react-native/ReactAndroid/build/third-party-ndk/fmt/include -I/Users/vojta/_dev/_own/document-picker/node_modules/react-native/ReactCommon/jsi -I/Users/vojta/_dev/_own/document-picker/node_modules/react-native/ReactCommon -I/Users/vojta/_dev/_own/document-picker/node_modules/react-native/ReactCommon/react/nativemodule/core -I/Users/vojta/_dev/_own/document-picker/node_modules/react-native/ReactCommon/react/nativemodule/core/platform/android -I/Users/vojta/_dev/_own/document-picker/node_modules/react-native/ReactCommon/reactperflogger/. -I/Users/vojta/_dev/_own/document-picker/node_modules/react-native/ReactAndroid/src/main/jni/react/jni/../.. -I/Users/vojta/_dev/_own/document-picker/node_modules/react-native/ReactAndroid/src/main/java/com/facebook/react/turbomodule/core/jni -I/Users/vojta/_dev/_own/document-picker/node_modules/react-native/ReactAndroid/src/main/jni/first-party/fb/include -I/Users/vojta/_dev/_own/document-picker/node_modules/react-native/ReactCommon/runtimeexecutor/. -I/Users/vojta/_dev/_own/document-picker/node_modules/react-native/ReactCommon/callinvoker/. -I/Users/vojta/_dev/_own/document-picker/node_modules/react-native/ReactAndroid/src/main/java/com/facebook/react/reactperflogger/jni -I/Users/vojta/_dev/_own/document-picker/node_modules/react-native/ReactAndroid/src/main/jni/first-party/fbgloginit/. -I/Users/vojta/_dev/_own/document-picker/node_modules/react-native/ReactCommon/logger/. -I/Users/vojta/_dev/_own/document-picker/node_modules/react-native/ReactCommon/react/renderer/graphics/platform/cxx -I/Users/vojta/_dev/_own/document-picker/node_modules/react-native/ReactAndroid/src/main/jni/first-party/yogajni/jni -I/Users/vojta/_dev/_own/document-picker/node_modules/react-native/ReactCommon/yoga/. -isystem /Users/vojta/_dev/_own/document-picker/node_modules/react-native/ReactAndroid/src/main/jni/first-party/fbjni/headers -g -DANDROID -fdata-sections -ffunction-sections -funwind-tables -fstack-protector-strong -no-canonical-prefixes -D_FORTIFY_SOURCE=2 -Wformat -Werror=format-security -O0 -fno-limit-debug-info -fPIC -Wall -Werror -std=c++1y -DLOG_TAG=\"ReactNative\" -fexceptions -frtti -std=c++17 -DFOLLY_NO_CONFIG=1 -DFOLLY_HAVE_CLOCK_GETTIME=1 -DFOLLY_USE_LIBCPP=1 -DFOLLY_MOBILE=1 -DFOLLY_HAVE_RECVMMSG=1 -DFOLLY_HAVE_PTHREAD=1 -DFOLLY_HAVE_XSI_STRERROR_R=1 -MD -MT build/generated/source/codegen/jni/CMakeFiles/react_codegen_rncore.dir/rncore-generated.cpp.o -MF build/generated/source/codegen/jni/CMakeFiles/react_codegen_rncore.dir/rncore-generated.cpp.o.d -o build/generated/source/codegen/jni/CMakeFiles/react_codegen_rncore.dir/rncore-generated.cpp.o -c /Users/vojta/_dev/_own/document-picker/node_modules/react-native/ReactAndroid/build/generated/source/codegen/jni/rncore-generated.cpp | |
/Users/vojta/_dev/_own/document-picker/node_modules/react-native/ReactAndroid/build/generated/source/codegen/jni/rncore-generated.cpp:17:164: error: too few arguments to function call, expected 7, have 6 | |
return static_cast<JavaTurboModule &>(turboModule).invokeJavaMethod(rt, VoidKind, "isReduceMotionEnabled", "(Lcom/facebook/react/bridge/Callback;)V", args, count); | |
~~~~~~~~~~~~~~~~~~~~~~~~~~~~~~~~~~~~~~~~~~~~~~~~~~~~~~~~~~~~ ^ | |
/Users/vojta/_dev/_own/document-picker/node_modules/react-native/ReactCommon/react/nativemodule/core/platform/android/ReactCommon/JavaTurboModule.h:47:3: note: 'invokeJavaMethod' declared here | |
jsi::Value invokeJavaMethod( | |
^ | |
/Users/vojta/_dev/_own/document-picker/node_modules/react-native/ReactAndroid/build/generated/source/codegen/jni/rncore-generated.cpp:21:168: error: too few arguments to function call, expected 7, have 6 | |
return static_cast<JavaTurboModule &>(turboModule).invokeJavaMethod(rt, VoidKind, "isTouchExplorationEnabled", "(Lcom/facebook/react/bridge/Callback;)V", args, count); | |
~~~~~~~~~~~~~~~~~~~~~~~~~~~~~~~~~~~~~~~~~~~~~~~~~~~~~~~~~~~~ ^ | |
/Users/vojta/_dev/_own/document-picker/node_modules/react-native/ReactCommon/react/nativemodule/core/platform/android/ReactCommon/JavaTurboModule.h:47:3: note: 'invokeJavaMethod' declared here | |
jsi::Value invokeJavaMethod( | |
^ | |
/Users/vojta/_dev/_own/document-picker/node_modules/react-native/ReactAndroid/build/generated/source/codegen/jni/rncore-generated.cpp:25:172: error: too few arguments to function call, expected 7, have 6 | |
return static_cast<JavaTurboModule &>(turboModule).invokeJavaMethod(rt, VoidKind, "isAccessibilityServiceEnabled", "(Lcom/facebook/react/bridge/Callback;)V", args, count); | |
~~~~~~~~~~~~~~~~~~~~~~~~~~~~~~~~~~~~~~~~~~~~~~~~~~~~~~~~~~~~ ^ | |
/Users/vojta/_dev/_own/document-picker/node_modules/react-native/ReactCommon/react/nativemodule/core/platform/android/ReactCommon/JavaTurboModule.h:47:3: note: 'invokeJavaMethod' declared here | |
jsi::Value invokeJavaMethod( | |
^ | |
/Users/vojta/_dev/_own/document-picker/node_modules/react-native/ReactAndroid/build/generated/source/codegen/jni/rncore-generated.cpp:29:129: error: too few arguments to function call, expected 7, have 6 | |
return static_cast<JavaTurboModule &>(turboModule).invokeJavaMethod(rt, VoidKind, "setAccessibilityFocus", "(D)V", args, count); | |
~~~~~~~~~~~~~~~~~~~~~~~~~~~~~~~~~~~~~~~~~~~~~~~~~~~~~~~~~~~~ ^ | |
/Users/vojta/_dev/_own/document-picker/node_modules/react-native/ReactCommon/react/nativemodule/core/platform/android/ReactCommon/JavaTurboModule.h:47:3: note: 'invokeJavaMethod' declared here | |
jsi::Value invokeJavaMethod( | |
^ | |
/Users/vojta/_dev/_own/document-picker/node_modules/react-native/ReactAndroid/build/generated/source/codegen/jni/rncore-generated.cpp:33:149: error: too few arguments to function call, expected 7, have 6 | |
return static_cast<JavaTurboModule &>(turboModule).invokeJavaMethod(rt, VoidKind, "announceForAccessibility", "(Ljava/lang/String;)V", args, count); | |
~~~~~~~~~~~~~~~~~~~~~~~~~~~~~~~~~~~~~~~~~~~~~~~~~~~~~~~~~~~~ ^ | |
/Users/vojta/_dev/_own/document-picker/node_modules/react-native/ReactCommon/react/nativemodule/core/platform/android/ReactCommon/JavaTurboModule.h:47:3: note: 'invokeJavaMethod' declared here | |
jsi::Value invokeJavaMethod( | |
^ | |
/Users/vojta/_dev/_own/document-picker/node_modules/react-native/ReactAndroid/build/generated/source/codegen/jni/rncore-generated.cpp:37:171: error: too few arguments to function call, expected 7, have 6 | |
return static_cast<JavaTurboModule &>(turboModule).invokeJavaMethod(rt, VoidKind, "getRecommendedTimeoutMillis", "(DLcom/facebook/react/bridge/Callback;)V", args, count); | |
~~~~~~~~~~~~~~~~~~~~~~~~~~~~~~~~~~~~~~~~~~~~~~~~~~~~~~~~~~~~ ^ | |
/Users/vojta/_dev/_own/document-picker/node_modules/react-native/ReactCommon/react/nativemodule/core/platform/android/ReactCommon/JavaTurboModule.h:47:3: note: 'invokeJavaMethod' declared here | |
jsi::Value invokeJavaMethod( | |
^ | |
/Users/vojta/_dev/_own/document-picker/node_modules/react-native/ReactAndroid/build/generated/source/codegen/jni/rncore-generated.cpp:50:202: error: too few arguments to function call, expected 7, have 6 | |
return static_cast<JavaTurboModule &>(turboModule).invokeJavaMethod(rt, VoidKind, "getCurrentBoldTextState", "(Lcom/facebook/react/bridge/Callback;Lcom/facebook/react/bridge/Callback;)V", args, count); | |
~~~~~~~~~~~~~~~~~~~~~~~~~~~~~~~~~~~~~~~~~~~~~~~~~~~~~~~~~~~~ ^ | |
/Users/vojta/_dev/_own/document-picker/node_modules/react-native/ReactCommon/react/nativemodule/core/platform/android/ReactCommon/JavaTurboModule.h:47:3: note: 'invokeJavaMethod' declared here | |
jsi::Value invokeJavaMethod( | |
^ | |
/Users/vojta/_dev/_own/document-picker/node_modules/react-native/ReactAndroid/build/generated/source/codegen/jni/rncore-generated.cpp:54:203: error: too few arguments to function call, expected 7, have 6 | |
return static_cast<JavaTurboModule &>(turboModule).invokeJavaMethod(rt, VoidKind, "getCurrentGrayscaleState", "(Lcom/facebook/react/bridge/Callback;Lcom/facebook/react/bridge/Callback;)V", args, count); | |
~~~~~~~~~~~~~~~~~~~~~~~~~~~~~~~~~~~~~~~~~~~~~~~~~~~~~~~~~~~~ ^ | |
/Users/vojta/_dev/_own/document-picker/node_modules/react-native/ReactCommon/react/nativemodule/core/platform/android/ReactCommon/JavaTurboModule.h:47:3: note: 'invokeJavaMethod' declared here | |
jsi::Value invokeJavaMethod( | |
^ | |
/Users/vojta/_dev/_own/document-picker/node_modules/react-native/ReactAndroid/build/generated/source/codegen/jni/rncore-generated.cpp:58:206: error: too few arguments to function call, expected 7, have 6 | |
return static_cast<JavaTurboModule &>(turboModule).invokeJavaMethod(rt, VoidKind, "getCurrentInvertColorsState", "(Lcom/facebook/react/bridge/Callback;Lcom/facebook/react/bridge/Callback;)V", args, count); | |
~~~~~~~~~~~~~~~~~~~~~~~~~~~~~~~~~~~~~~~~~~~~~~~~~~~~~~~~~~~~ ^ | |
/Users/vojta/_dev/_own/document-picker/node_modules/react-native/ReactCommon/react/nativemodule/core/platform/android/ReactCommon/JavaTurboModule.h:47:3: note: 'invokeJavaMethod' declared here | |
jsi::Value invokeJavaMethod( | |
^ | |
/Users/vojta/_dev/_own/document-picker/node_modules/react-native/ReactAndroid/build/generated/source/codegen/jni/rncore-generated.cpp:62:206: error: too few arguments to function call, expected 7, have 6 | |
return static_cast<JavaTurboModule &>(turboModule).invokeJavaMethod(rt, VoidKind, "getCurrentReduceMotionState", "(Lcom/facebook/react/bridge/Callback;Lcom/facebook/react/bridge/Callback;)V", args, count); | |
~~~~~~~~~~~~~~~~~~~~~~~~~~~~~~~~~~~~~~~~~~~~~~~~~~~~~~~~~~~~ ^ | |
/Users/vojta/_dev/_own/document-picker/node_modules/react-native/ReactCommon/react/nativemodule/core/platform/android/ReactCommon/JavaTurboModule.h:47:3: note: 'invokeJavaMethod' declared here | |
jsi::Value invokeJavaMethod( | |
^ | |
/Users/vojta/_dev/_own/document-picker/node_modules/react-native/ReactAndroid/build/generated/source/codegen/jni/rncore-generated.cpp:66:221: error: too few arguments to function call, expected 7, have 6 | |
return static_cast<JavaTurboModule &>(turboModule).invokeJavaMethod(rt, VoidKind, "getCurrentPrefersCrossFadeTransitionsState", "(Lcom/facebook/react/bridge/Callback;Lcom/facebook/react/bridge/Callback;)V", args, count); | |
~~~~~~~~~~~~~~~~~~~~~~~~~~~~~~~~~~~~~~~~~~~~~~~~~~~~~~~~~~~~ ^ | |
/Users/vojta/_dev/_own/document-picker/node_modules/react-native/ReactCommon/react/nativemodule/core/platform/android/ReactCommon/JavaTurboModule.h:47:3: note: 'invokeJavaMethod' declared here | |
jsi::Value invokeJavaMethod( | |
^ | |
/Users/vojta/_dev/_own/document-picker/node_modules/react-native/ReactAndroid/build/generated/source/codegen/jni/rncore-generated.cpp:70:212: error: too few arguments to function call, expected 7, have 6 | |
return static_cast<JavaTurboModule &>(turboModule).invokeJavaMethod(rt, VoidKind, "getCurrentReduceTransparencyState", "(Lcom/facebook/react/bridge/Callback;Lcom/facebook/react/bridge/Callback;)V", args, count); | |
~~~~~~~~~~~~~~~~~~~~~~~~~~~~~~~~~~~~~~~~~~~~~~~~~~~~~~~~~~~~ ^ | |
/Users/vojta/_dev/_own/document-picker/node_modules/react-native/ReactCommon/react/nativemodule/core/platform/android/ReactCommon/JavaTurboModule.h:47:3: note: 'invokeJavaMethod' declared here | |
jsi::Value invokeJavaMethod( | |
^ | |
/Users/vojta/_dev/_own/document-picker/node_modules/react-native/ReactAndroid/build/generated/source/codegen/jni/rncore-generated.cpp:74:203: error: too few arguments to function call, expected 7, have 6 | |
return static_cast<JavaTurboModule &>(turboModule).invokeJavaMethod(rt, VoidKind, "getCurrentVoiceOverState", "(Lcom/facebook/react/bridge/Callback;Lcom/facebook/react/bridge/Callback;)V", args, count); | |
~~~~~~~~~~~~~~~~~~~~~~~~~~~~~~~~~~~~~~~~~~~~~~~~~~~~~~~~~~~~ ^ | |
/Users/vojta/_dev/_own/document-picker/node_modules/react-native/ReactCommon/react/nativemodule/core/platform/android/ReactCommon/JavaTurboModule.h:47:3: note: 'invokeJavaMethod' declared here | |
jsi::Value invokeJavaMethod( | |
^ | |
/Users/vojta/_dev/_own/document-picker/node_modules/react-native/ReactAndroid/build/generated/source/codegen/jni/rncore-generated.cpp:78:184: error: too few arguments to function call, expected 7, have 6 | |
return static_cast<JavaTurboModule &>(turboModule).invokeJavaMethod(rt, VoidKind, "setAccessibilityContentSizeMultipliers", "(Lcom/facebook/react/bridge/ReadableMap;)V", args, count); | |
~~~~~~~~~~~~~~~~~~~~~~~~~~~~~~~~~~~~~~~~~~~~~~~~~~~~~~~~~~~~ ^ | |
/Users/vojta/_dev/_own/document-picker/node_modules/react-native/ReactCommon/react/nativemodule/core/platform/android/ReactCommon/JavaTurboModule.h:47:3: note: 'invokeJavaMethod' declared here | |
jsi::Value invokeJavaMethod( | |
^ | |
/Users/vojta/_dev/_own/document-picker/node_modules/react-native/ReactAndroid/build/generated/source/codegen/jni/rncore-generated.cpp:82:129: error: too few arguments to function call, expected 7, have 6 | |
return static_cast<JavaTurboModule &>(turboModule).invokeJavaMethod(rt, VoidKind, "setAccessibilityFocus", "(D)V", args, count); | |
~~~~~~~~~~~~~~~~~~~~~~~~~~~~~~~~~~~~~~~~~~~~~~~~~~~~~~~~~~~~ ^ | |
/Users/vojta/_dev/_own/document-picker/node_modules/react-native/ReactCommon/react/nativemodule/core/platform/android/ReactCommon/JavaTurboModule.h:47:3: note: 'invokeJavaMethod' declared here | |
jsi::Value invokeJavaMethod( | |
^ | |
/Users/vojta/_dev/_own/document-picker/node_modules/react-native/ReactAndroid/build/generated/source/codegen/jni/rncore-generated.cpp:86:149: error: too few arguments to function call, expected 7, have 6 | |
return static_cast<JavaTurboModule &>(turboModule).invokeJavaMethod(rt, VoidKind, "announceForAccessibility", "(Ljava/lang/String;)V", args, count); | |
~~~~~~~~~~~~~~~~~~~~~~~~~~~~~~~~~~~~~~~~~~~~~~~~~~~~~~~~~~~~ ^ | |
/Users/vojta/_dev/_own/document-picker/node_modules/react-native/ReactCommon/react/nativemodule/core/platform/android/ReactCommon/JavaTurboModule.h:47:3: note: 'invokeJavaMethod' declared here | |
jsi::Value invokeJavaMethod( | |
^ | |
/Users/vojta/_dev/_own/document-picker/node_modules/react-native/ReactAndroid/build/generated/source/codegen/jni/rncore-generated.cpp:90:199: error: too few arguments to function call, expected 7, have 6 | |
return static_cast<JavaTurboModule &>(turboModule).invokeJavaMethod(rt, VoidKind, "announceForAccessibilityWithOptions", "(Ljava/lang/String;Lcom/facebook/react/bridge/ReadableMap;)V", args, count); | |
~~~~~~~~~~~~~~~~~~~~~~~~~~~~~~~~~~~~~~~~~~~~~~~~~~~~~~~~~~~~ ^ | |
/Users/vojta/_dev/_own/document-picker/node_modules/react-native/ReactCommon/react/nativemodule/core/platform/android/ReactCommon/JavaTurboModule.h:47:3: note: 'invokeJavaMethod' declared here | |
jsi::Value invokeJavaMethod( | |
^ | |
/Users/vojta/_dev/_own/document-picker/node_modules/react-native/ReactAndroid/build/generated/source/codegen/jni/rncore-generated.cpp:110:208: error: too few arguments to function call, expected 7, have 6 | |
return static_cast<JavaTurboModule &>(turboModule).invokeJavaMethod(rt, VoidKind, "showActionSheetWithOptions", "(Lcom/facebook/react/bridge/ReadableMap;Lcom/facebook/react/bridge/Callback;)V", args, count); | |
~~~~~~~~~~~~~~~~~~~~~~~~~~~~~~~~~~~~~~~~~~~~~~~~~~~~~~~~~~~~ ^ | |
/Users/vojta/_dev/_own/document-picker/node_modules/react-native/ReactCommon/react/nativemodule/core/platform/android/ReactCommon/JavaTurboModule.h:47:3: note: 'invokeJavaMethod' declared here | |
jsi::Value invokeJavaMethod( | |
^ | |
/Users/vojta/_dev/_own/document-picker/node_modules/react-native/ReactAndroid/build/generated/source/codegen/jni/rncore-generated.cpp:114:249: error: too few arguments to function call, expected 7, have 6 | |
return static_cast<JavaTurboModule &>(turboModule).invokeJavaMethod(rt, VoidKind, "showShareActionSheetWithOptions", "(Lcom/facebook/react/bridge/ReadableMap;Lcom/facebook/react/bridge/Callback;Lcom/facebook/react/bridge/Callback;)V", args, count); | |
~~~~~~~~~~~~~~~~~~~~~~~~~~~~~~~~~~~~~~~~~~~~~~~~~~~~~~~~~~~~ ^ | |
/Users/vojta/_dev/_own/document-picker/node_modules/react-native/ReactCommon/react/nativemodule/core/platform/android/ReactCommon/JavaTurboModule.h:47:3: note: 'invokeJavaMethod' declared here | |
jsi::Value invokeJavaMethod( | |
^ | |
fatal error: too many errors emitted, stopping now [-ferror-limit=] | |
20 errors generated. | |
[17/167] Linking CXX shared library /Users/vojta/_dev/_own/document-picker/node_modules/react-native/ReactAndroid/build/intermediates/cxx/Debug/3d5q5820/obj/arm64-v8a/libreact_render_debug.so | |
[18/167] Building CXX object ReactCommon/react/renderer/imagemanager/CMakeFiles/react_render_imagemanager.dir/ImageTelemetry.cpp.o | |
[19/167] Building CXX object ReactCommon/react/renderer/components/unimplementedview/CMakeFiles/rrc_unimplementedview.dir/UnimplementedViewShadowNode.cpp.o | |
[20/167] Building CXX object ReactCommon/react/renderer/components/text/CMakeFiles/rrc_text.dir/ParagraphShadowNode.cpp.o | |
[21/167] Building CXX object ReactCommon/react/renderer/imagemanager/CMakeFiles/react_render_imagemanager.dir/platform/cxx/react/renderer/imagemanager/ImageManager.cpp.o | |
[22/167] Building CXX object ReactCommon/react/renderer/imagemanager/CMakeFiles/react_render_imagemanager.dir/platform/cxx/react/renderer/imagemanager/ImageRequest.cpp.o | |
[23/167] Building CXX object ReactCommon/react/renderer/components/view/CMakeFiles/rrc_view.dir/PointerEvent.cpp.o | |
[24/167] Building CXX object ReactCommon/react/renderer/components/view/CMakeFiles/rrc_view.dir/Touch.cpp.o | |
[25/167] Building CXX object ReactCommon/react/renderer/components/view/CMakeFiles/rrc_view.dir/TouchEvent.cpp.o | |
[26/167] Building CXX object ReactCommon/react/renderer/components/view/CMakeFiles/rrc_view.dir/TouchEventEmitter.cpp.o | |
[27/167] Building CXX object ReactCommon/react/renderer/components/view/CMakeFiles/rrc_view.dir/AccessibilityProps.cpp.o | |
ninja: build stopped: subcommand failed. | |
* Try: | |
> Run with --stacktrace option to get the stack trace. | |
> Run with --info or --debug option to get more log output. | |
> Run with --scan to get full insights. | |
* Get more help at https://help.gradle.org | |
BUILD FAILED in 17s | |
Error: Command failed: ./gradlew app:installDebug -PreactNativeDevServerPort=8081 -PreactNativeDebugArchitectures=arm64-v8a -PreactNativeArchitectures=arm64-v8a | |
CMake Deprecation Warning at CMakeLists.txt:42 (cmake_policy): | |
The OLD behavior for policy CMP0026 will be removed from a future version | |
of CMake. | |
The cmake-policies(7) manual explains that the OLD behaviors of all | |
policies are deprecated and that a policy should be set to OLD only under | |
specific short-term circumstances. Projects should be ported to the NEW | |
behavior and not rely on setting a policy to OLD. | |
FAILURE: Build failed with an exception. | |
* What went wrong: | |
Execution failed for task ':ReactAndroid:buildCMakeDebug[arm64-v8a][fabricjni,hermes-executor-debug,etc]'. | |
> Build command failed. | |
Error while executing process /Users/vojta/Library/Android/sdk/cmake/3.18.1/bin/ninja with arguments {-C /Users/vojta/_dev/_own/document-picker/node_modules/react-native/ReactAndroid/.cxx/Debug/3d5q5820/arm64-v8a fabricjni hermes-executor-debug jscexecutor jsijniprofiler reactnativeblob reactnativejni reactperfloggerjni turbomodulejsijni} | |
ninja: Entering directory `/Users/vojta/_dev/_own/document-picker/node_modules/react-native/ReactAndroid/.cxx/Debug/3d5q5820/arm64-v8a' | |
[0/2] Re-checking globbed directories... | |
[1/167] Building CXX object ReactCommon/react/renderer/components/text/CMakeFiles/rrc_text.dir/RawTextShadowNode.cpp.o | |
[2/167] Building CXX object ReactCommon/react/renderer/components/unimplementedview/CMakeFiles/rrc_unimplementedview.dir/UnimplementedViewProps.cpp.o | |
[3/167] Building CXX object ReactCommon/react/renderer/components/text/CMakeFiles/rrc_text.dir/TextProps.cpp.o | |
[4/167] Building CXX object ReactCommon/react/renderer/components/text/CMakeFiles/rrc_text.dir/TextShadowNode.cpp.o | |
[5/167] Building CXX object ReactCommon/react/renderer/components/text/CMakeFiles/rrc_text.dir/RawTextProps.cpp.o | |
[6/167] Building CXX object ReactCommon/react/renderer/components/text/CMakeFiles/rrc_text.dir/BaseTextShadowNode.cpp.o | |
[7/167] Building CXX object ReactCommon/react/renderer/imagemanager/CMakeFiles/react_render_imagemanager.dir/ImageResponse.cpp.o | |
[8/167] Building CXX object ReactCommon/react/renderer/debug/CMakeFiles/react_render_debug.dir/DebugStringConvertibleItem.cpp.o | |
[9/167] Building CXX object ReactCommon/react/renderer/components/text/CMakeFiles/rrc_text.dir/ParagraphEventEmitter.cpp.o | |
[10/167] Building CXX object ReactCommon/react/renderer/imagemanager/CMakeFiles/react_render_imagemanager.dir/ImageResponseObserverCoordinator.cpp.o | |
[11/167] Building CXX object ReactCommon/react/renderer/components/text/CMakeFiles/rrc_text.dir/ParagraphProps.cpp.o | |
[12/167] Building CXX object ReactCommon/react/renderer/components/text/CMakeFiles/rrc_text.dir/BaseTextProps.cpp.o | |
[13/167] Building CXX object ReactCommon/react/renderer/components/unimplementedview/CMakeFiles/rrc_unimplementedview.dir/UnimplementedViewComponentDescriptor.cpp.o | |
[14/167] Building CXX object ReactCommon/react/renderer/components/text/CMakeFiles/rrc_text.dir/ParagraphState.cpp.o | |
[15/167] Building CXX object ReactCommon/react/renderer/debug/CMakeFiles/react_render_debug.dir/DebugStringConvertible.cpp.o | |
[16/167] Building CXX object build/generated/source/codegen/jni/CMakeFiles/react_codegen_rncore.dir/rncore-generated.cpp.o | |
FAILED: build/generated/source/codegen/jni/CMakeFiles/react_codegen_rncore.dir/rncore-generated.cpp.o | |
/Users/vojta/Library/Android/sdk/ndk/21.4.7075529/toolchains/llvm/prebuilt/darwin-x86_64/bin/clang++ --target=aarch64-none-linux-android21 --gcc-toolchain=/Users/vojta/Library/Android/sdk/ndk/21.4.7075529/toolchains/llvm/prebuilt/darwin-x86_64 --sysroot=/Users/vojta/Library/Android/sdk/ndk/21.4.7075529/toolchains/llvm/prebuilt/darwin-x86_64/sysroot -Dreact_codegen_rncore_EXPORTS -I/Users/vojta/_dev/_own/document-picker/node_modules/react-native/ReactAndroid/build/generated/source/codegen/jni/. -I/Users/vojta/_dev/_own/document-picker/node_modules/react-native/ReactAndroid/build/generated/source/codegen/jni/react/renderer/components/rncore -I/Users/vojta/_dev/_own/document-picker/node_modules/react-native/ReactAndroid/build/third-party-ndk/folly/. -I/Users/vojta/_dev/_own/document-picker/node_modules/react-native/ReactAndroid/build/third-party-ndk/glog/exported -I/Users/vojta/_dev/_own/document-picker/node_modules/react-native/ReactAndroid/build/third-party-ndk/double-conversion/. -I/Users/vojta/_dev/_own/document-picker/node_modules/react-native/ReactAndroid/build/third-party-ndk/boost/boost_1_76_0 -I/Users/vojta/_dev/_own/document-picker/node_modules/react-native/ReactAndroid/build/third-party-ndk/fmt/include -I/Users/vojta/_dev/_own/document-picker/node_modules/react-native/ReactCommon/jsi -I/Users/vojta/_dev/_own/document-picker/node_modules/react-native/ReactCommon -I/Users/vojta/_dev/_own/document-picker/node_modules/react-native/ReactCommon/react/nativemodule/core -I/Users/vojta/_dev/_own/document-picker/node_modules/react-native/ReactCommon/react/nativemodule/core/platform/android -I/Users/vojta/_dev/_own/document-picker/node_modules/react-native/ReactCommon/reactperflogger/. -I/Users/vojta/_dev/_own/document-picker/node_modules/react-native/ReactAndroid/src/main/jni/react/jni/../.. -I/Users/vojta/_dev/_own/document-picker/node_modules/react-native/ReactAndroid/src/main/java/com/facebook/react/turbomodule/core/jni -I/Users/vojta/_dev/_own/document-picker/node_modules/react-native/ReactAndroid/src/main/jni/first-party/fb/include -I/Users/vojta/_dev/_own/document-picker/node_modules/react-native/ReactCommon/runtimeexecutor/. -I/Users/vojta/_dev/_own/document-picker/node_modules/react-native/ReactCommon/callinvoker/. -I/Users/vojta/_dev/_own/document-picker/node_modules/react-native/ReactAndroid/src/main/java/com/facebook/react/reactperflogger/jni -I/Users/vojta/_dev/_own/document-picker/node_modules/react-native/ReactAndroid/src/main/jni/first-party/fbgloginit/. -I/Users/vojta/_dev/_own/document-picker/node_modules/react-native/ReactCommon/logger/. -I/Users/vojta/_dev/_own/document-picker/node_modules/react-native/ReactCommon/react/renderer/graphics/platform/cxx -I/Users/vojta/_dev/_own/document-picker/node_modules/react-native/ReactAndroid/src/main/jni/first-party/yogajni/jni -I/Users/vojta/_dev/_own/document-picker/node_modules/react-native/ReactCommon/yoga/. -isystem /Users/vojta/_dev/_own/document-picker/node_modules/react-native/ReactAndroid/src/main/jni/first-party/fbjni/headers -g -DANDROID -fdata-sections -ffunction-sections -funwind-tables -fstack-protector-strong -no-canonical-prefixes -D_FORTIFY_SOURCE=2 -Wformat -Werror=format-security -O0 -fno-limit-debug-info -fPIC -Wall -Werror -std=c++1y -DLOG_TAG=\"ReactNative\" -fexceptions -frtti -std=c++17 -DFOLLY_NO_CONFIG=1 -DFOLLY_HAVE_CLOCK_GETTIME=1 -DFOLLY_USE_LIBCPP=1 -DFOLLY_MOBILE=1 -DFOLLY_HAVE_RECVMMSG=1 -DFOLLY_HAVE_PTHREAD=1 -DFOLLY_HAVE_XSI_STRERROR_R=1 -MD -MT build/generated/source/codegen/jni/CMakeFiles/react_codegen_rncore.dir/rncore-generated.cpp.o -MF build/generated/source/codegen/jni/CMakeFiles/react_codegen_rncore.dir/rncore-generated.cpp.o.d -o build/generated/source/codegen/jni/CMakeFiles/react_codegen_rncore.dir/rncore-generated.cpp.o -c /Users/vojta/_dev/_own/document-picker/node_modules/react-native/ReactAndroid/build/generated/source/codegen/jni/rncore-generated.cpp | |
/Users/vojta/_dev/_own/document-picker/node_modules/react-native/ReactAndroid/build/generated/source/codegen/jni/rncore-generated.cpp:17:164: error: too few arguments to function call, expected 7, have 6 | |
return static_cast<JavaTurboModule &>(turboModule).invokeJavaMethod(rt, VoidKind, "isReduceMotionEnabled", "(Lcom/facebook/react/bridge/Callback;)V", args, count); | |
~~~~~~~~~~~~~~~~~~~~~~~~~~~~~~~~~~~~~~~~~~~~~~~~~~~~~~~~~~~~ ^ | |
/Users/vojta/_dev/_own/document-picker/node_modules/react-native/ReactCommon/react/nativemodule/core/platform/android/ReactCommon/JavaTurboModule.h:47:3: note: 'invokeJavaMethod' declared here | |
jsi::Value invokeJavaMethod( | |
^ | |
/Users/vojta/_dev/_own/document-picker/node_modules/react-native/ReactAndroid/build/generated/source/codegen/jni/rncore-generated.cpp:21:168: error: too few arguments to function call, expected 7, have 6 | |
return static_cast<JavaTurboModule &>(turboModule).invokeJavaMethod(rt, VoidKind, "isTouchExplorationEnabled", "(Lcom/facebook/react/bridge/Callback;)V", args, count); | |
~~~~~~~~~~~~~~~~~~~~~~~~~~~~~~~~~~~~~~~~~~~~~~~~~~~~~~~~~~~~ ^ | |
/Users/vojta/_dev/_own/document-picker/node_modules/react-native/ReactCommon/react/nativemodule/core/platform/android/ReactCommon/JavaTurboModule.h:47:3: note: 'invokeJavaMethod' declared here | |
jsi::Value invokeJavaMethod( | |
^ | |
/Users/vojta/_dev/_own/document-picker/node_modules/react-native/ReactAndroid/build/generated/source/codegen/jni/rncore-generated.cpp:25:172: error: too few arguments to function call, expected 7, have 6 | |
return static_cast<JavaTurboModule &>(turboModule).invokeJavaMethod(rt, VoidKind, "isAccessibilityServiceEnabled", "(Lcom/facebook/react/bridge/Callback;)V", args, count); | |
~~~~~~~~~~~~~~~~~~~~~~~~~~~~~~~~~~~~~~~~~~~~~~~~~~~~~~~~~~~~ ^ | |
/Users/vojta/_dev/_own/document-picker/node_modules/react-native/ReactCommon/react/nativemodule/core/platform/android/ReactCommon/JavaTurboModule.h:47:3: note: 'invokeJavaMethod' declared here | |
jsi::Value invokeJavaMethod( | |
^ | |
/Users/vojta/_dev/_own/document-picker/node_modules/react-native/ReactAndroid/build/generated/source/codegen/jni/rncore-generated.cpp:29:129: error: too few arguments to function call, expected 7, have 6 | |
return static_cast<JavaTurboModule &>(turboModule).invokeJavaMethod(rt, VoidKind, "setAccessibilityFocus", "(D)V", args, count); | |
~~~~~~~~~~~~~~~~~~~~~~~~~~~~~~~~~~~~~~~~~~~~~~~~~~~~~~~~~~~~ ^ | |
/Users/vojta/_dev/_own/document-picker/node_modules/react-native/ReactCommon/react/nativemodule/core/platform/android/ReactCommon/JavaTurboModule.h:47:3: note: 'invokeJavaMethod' declared here | |
jsi::Value invokeJavaMethod( | |
^ | |
/Users/vojta/_dev/_own/document-picker/node_modules/react-native/ReactAndroid/build/generated/source/codegen/jni/rncore-generated.cpp:33:149: error: too few arguments to function call, expected 7, have 6 | |
return static_cast<JavaTurboModule &>(turboModule).invokeJavaMethod(rt, VoidKind, "announceForAccessibility", "(Ljava/lang/String;)V", args, count); | |
~~~~~~~~~~~~~~~~~~~~~~~~~~~~~~~~~~~~~~~~~~~~~~~~~~~~~~~~~~~~ ^ | |
/Users/vojta/_dev/_own/document-picker/node_modules/react-native/ReactCommon/react/nativemodule/core/platform/android/ReactCommon/JavaTurboModule.h:47:3: note: 'invokeJavaMethod' declared here | |
jsi::Value invokeJavaMethod( | |
^ | |
/Users/vojta/_dev/_own/document-picker/node_modules/react-native/ReactAndroid/build/generated/source/codegen/jni/rncore-generated.cpp:37:171: error: too few arguments to function call, expected 7, have 6 | |
return static_cast<JavaTurboModule &>(turboModule).invokeJavaMethod(rt, VoidKind, "getRecommendedTimeoutMillis", "(DLcom/facebook/react/bridge/Callback;)V", args, count); | |
~~~~~~~~~~~~~~~~~~~~~~~~~~~~~~~~~~~~~~~~~~~~~~~~~~~~~~~~~~~~ ^ | |
/Users/vojta/_dev/_own/document-picker/node_modules/react-native/ReactCommon/react/nativemodule/core/platform/android/ReactCommon/JavaTurboModule.h:47:3: note: 'invokeJavaMethod' declared here | |
jsi::Value invokeJavaMethod( | |
^ | |
/Users/vojta/_dev/_own/document-picker/node_modules/react-native/ReactAndroid/build/generated/source/codegen/jni/rncore-generated.cpp:50:202: error: too few arguments to function call, expected 7, have 6 | |
return static_cast<JavaTurboModule &>(turboModule).invokeJavaMethod(rt, VoidKind, "getCurrentBoldTextState", "(Lcom/facebook/react/bridge/Callback;Lcom/facebook/react/bridge/Callback;)V", args, count); | |
~~~~~~~~~~~~~~~~~~~~~~~~~~~~~~~~~~~~~~~~~~~~~~~~~~~~~~~~~~~~ ^ | |
/Users/vojta/_dev/_own/document-picker/node_modules/react-native/ReactCommon/react/nativemodule/core/platform/android/ReactCommon/JavaTurboModule.h:47:3: note: 'invokeJavaMethod' declared here | |
jsi::Value invokeJavaMethod( | |
^ | |
/Users/vojta/_dev/_own/document-picker/node_modules/react-native/ReactAndroid/build/generated/source/codegen/jni/rncore-generated.cpp:54:203: error: too few arguments to function call, expected 7, have 6 | |
return static_cast<JavaTurboModule &>(turboModule).invokeJavaMethod(rt, VoidKind, "getCurrentGrayscaleState", "(Lcom/facebook/react/bridge/Callback;Lcom/facebook/react/bridge/Callback;)V", args, count); | |
~~~~~~~~~~~~~~~~~~~~~~~~~~~~~~~~~~~~~~~~~~~~~~~~~~~~~~~~~~~~ ^ | |
/Users/vojta/_dev/_own/document-picker/node_modules/react-native/ReactCommon/react/nativemodule/core/platform/android/ReactCommon/JavaTurboModule.h:47:3: note: 'invokeJavaMethod' declared here | |
jsi::Value invokeJavaMethod( | |
^ | |
/Users/vojta/_dev/_own/document-picker/node_modules/react-native/ReactAndroid/build/generated/source/codegen/jni/rncore-generated.cpp:58:206: error: too few arguments to function call, expected 7, have 6 | |
return static_cast<JavaTurboModule &>(turboModule).invokeJavaMethod(rt, VoidKind, "getCurrentInvertColorsState", "(Lcom/facebook/react/bridge/Callback;Lcom/facebook/react/bridge/Callback;)V", args, count); | |
~~~~~~~~~~~~~~~~~~~~~~~~~~~~~~~~~~~~~~~~~~~~~~~~~~~~~~~~~~~~ ^ | |
/Users/vojta/_dev/_own/document-picker/node_modules/react-native/ReactCommon/react/nativemodule/core/platform/android/ReactCommon/JavaTurboModule.h:47:3: note: 'invokeJavaMethod' declared here | |
jsi::Value invokeJavaMethod( | |
^ | |
/Users/vojta/_dev/_own/document-picker/node_modules/react-native/ReactAndroid/build/generated/source/codegen/jni/rncore-generated.cpp:62:206: error: too few arguments to function call, expected 7, have 6 | |
return static_cast<JavaTurboModule &>(turboModule).invokeJavaMethod(rt, VoidKind, "getCurrentReduceMotionState", "(Lcom/facebook/react/bridge/Callback;Lcom/facebook/react/bridge/Callback;)V", args, count); | |
~~~~~~~~~~~~~~~~~~~~~~~~~~~~~~~~~~~~~~~~~~~~~~~~~~~~~~~~~~~~ ^ | |
/Users/vojta/_dev/_own/document-picker/node_modules/react-native/ReactCommon/react/nativemodule/core/platform/android/ReactCommon/JavaTurboModule.h:47:3: note: 'invokeJavaMethod' declared here | |
jsi::Value invokeJavaMethod( | |
^ | |
/Users/vojta/_dev/_own/document-picker/node_modules/react-native/ReactAndroid/build/generated/source/codegen/jni/rncore-generated.cpp:66:221: error: too few arguments to function call, expected 7, have 6 | |
return static_cast<JavaTurboModule &>(turboModule).invokeJavaMethod(rt, VoidKind, "getCurrentPrefersCrossFadeTransitionsState", "(Lcom/facebook/react/bridge/Callback;Lcom/facebook/react/bridge/Callback;)V", args, count); | |
~~~~~~~~~~~~~~~~~~~~~~~~~~~~~~~~~~~~~~~~~~~~~~~~~~~~~~~~~~~~ ^ | |
/Users/vojta/_dev/_own/document-picker/node_modules/react-native/ReactCommon/react/nativemodule/core/platform/android/ReactCommon/JavaTurboModule.h:47:3: note: 'invokeJavaMethod' declared here | |
jsi::Value invokeJavaMethod( | |
^ | |
/Users/vojta/_dev/_own/document-picker/node_modules/react-native/ReactAndroid/build/generated/source/codegen/jni/rncore-generated.cpp:70:212: error: too few arguments to function call, expected 7, have 6 | |
return static_cast<JavaTurboModule &>(turboModule).invokeJavaMethod(rt, VoidKind, "getCurrentReduceTransparencyState", "(Lcom/facebook/react/bridge/Callback;Lcom/facebook/react/bridge/Callback;)V", args, count); | |
~~~~~~~~~~~~~~~~~~~~~~~~~~~~~~~~~~~~~~~~~~~~~~~~~~~~~~~~~~~~ ^ | |
/Users/vojta/_dev/_own/document-picker/node_modules/react-native/ReactCommon/react/nativemodule/core/platform/android/ReactCommon/JavaTurboModule.h:47:3: note: 'invokeJavaMethod' declared here | |
jsi::Value invokeJavaMethod( | |
^ | |
/Users/vojta/_dev/_own/document-picker/node_modules/react-native/ReactAndroid/build/generated/source/codegen/jni/rncore-generated.cpp:74:203: error: too few arguments to function call, expected 7, have 6 | |
return static_cast<JavaTurboModule &>(turboModule).invokeJavaMethod(rt, VoidKind, "getCurrentVoiceOverState", "(Lcom/facebook/react/bridge/Callback;Lcom/facebook/react/bridge/Callback;)V", args, count); | |
~~~~~~~~~~~~~~~~~~~~~~~~~~~~~~~~~~~~~~~~~~~~~~~~~~~~~~~~~~~~ ^ | |
/Users/vojta/_dev/_own/document-picker/node_modules/react-native/ReactCommon/react/nativemodule/core/platform/android/ReactCommon/JavaTurboModule.h:47:3: note: 'invokeJavaMethod' declared here | |
jsi::Value invokeJavaMethod( | |
^ | |
/Users/vojta/_dev/_own/document-picker/node_modules/react-native/ReactAndroid/build/generated/source/codegen/jni/rncore-generated.cpp:78:184: error: too few arguments to function call, expected 7, have 6 | |
return static_cast<JavaTurboModule &>(turboModule).invokeJavaMethod(rt, VoidKind, "setAccessibilityContentSizeMultipliers", "(Lcom/facebook/react/bridge/ReadableMap;)V", args, count); | |
~~~~~~~~~~~~~~~~~~~~~~~~~~~~~~~~~~~~~~~~~~~~~~~~~~~~~~~~~~~~ ^ | |
/Users/vojta/_dev/_own/document-picker/node_modules/react-native/ReactCommon/react/nativemodule/core/platform/android/ReactCommon/JavaTurboModule.h:47:3: note: 'invokeJavaMethod' declared here | |
jsi::Value invokeJavaMethod( | |
^ | |
/Users/vojta/_dev/_own/document-picker/node_modules/react-native/ReactAndroid/build/generated/source/codegen/jni/rncore-generated.cpp:82:129: error: too few arguments to function call, expected 7, have 6 | |
return static_cast<JavaTurboModule &>(turboModule).invokeJavaMethod(rt, VoidKind, "setAccessibilityFocus", "(D)V", args, count); | |
~~~~~~~~~~~~~~~~~~~~~~~~~~~~~~~~~~~~~~~~~~~~~~~~~~~~~~~~~~~~ ^ | |
/Users/vojta/_dev/_own/document-picker/node_modules/react-native/ReactCommon/react/nativemodule/core/platform/android/ReactCommon/JavaTurboModule.h:47:3: note: 'invokeJavaMethod' declared here | |
jsi::Value invokeJavaMethod( | |
^ | |
/Users/vojta/_dev/_own/document-picker/node_modules/react-native/ReactAndroid/build/generated/source/codegen/jni/rncore-generated.cpp:86:149: error: too few arguments to function call, expected 7, have 6 | |
return static_cast<JavaTurboModule &>(turboModule).invokeJavaMethod(rt, VoidKind, "announceForAccessibility", "(Ljava/lang/String;)V", args, count); | |
~~~~~~~~~~~~~~~~~~~~~~~~~~~~~~~~~~~~~~~~~~~~~~~~~~~~~~~~~~~~ ^ | |
/Users/vojta/_dev/_own/document-picker/node_modules/react-native/ReactCommon/react/nativemodule/core/platform/android/ReactCommon/JavaTurboModule.h:47:3: note: 'invokeJavaMethod' declared here | |
jsi::Value invokeJavaMethod( | |
^ | |
/Users/vojta/_dev/_own/document-picker/node_modules/react-native/ReactAndroid/build/generated/source/codegen/jni/rncore-generated.cpp:90:199: error: too few arguments to function call, expected 7, have 6 | |
return static_cast<JavaTurboModule &>(turboModule).invokeJavaMethod(rt, VoidKind, "announceForAccessibilityWithOptions", "(Ljava/lang/String;Lcom/facebook/react/bridge/ReadableMap;)V", args, count); | |
~~~~~~~~~~~~~~~~~~~~~~~~~~~~~~~~~~~~~~~~~~~~~~~~~~~~~~~~~~~~ ^ | |
/Users/vojta/_dev/_own/document-picker/node_modules/react-native/ReactCommon/react/nativemodule/core/platform/android/ReactCommon/JavaTurboModule.h:47:3: note: 'invokeJavaMethod' declared here | |
jsi::Value invokeJavaMethod( | |
^ | |
/Users/vojta/_dev/_own/document-picker/node_modules/react-native/ReactAndroid/build/generated/source/codegen/jni/rncore-generated.cpp:110:208: error: too few arguments to function call, expected 7, have 6 | |
return static_cast<JavaTurboModule &>(turboModule).invokeJavaMethod(rt, VoidKind, "showActionSheetWithOptions", "(Lcom/facebook/react/bridge/ReadableMap;Lcom/facebook/react/bridge/Callback;)V", args, count); | |
~~~~~~~~~~~~~~~~~~~~~~~~~~~~~~~~~~~~~~~~~~~~~~~~~~~~~~~~~~~~ ^ | |
/Users/vojta/_dev/_own/document-picker/node_modules/react-native/ReactCommon/react/nativemodule/core/platform/android/ReactCommon/JavaTurboModule.h:47:3: note: 'invokeJavaMethod' declared here | |
jsi::Value invokeJavaMethod( | |
^ | |
/Users/vojta/_dev/_own/document-picker/node_modules/react-native/ReactAndroid/build/generated/source/codegen/jni/rncore-generated.cpp:114:249: error: too few arguments to function call, expected 7, have 6 | |
return static_cast<JavaTurboModule &>(turboModule).invokeJavaMethod(rt, VoidKind, "showShareActionSheetWithOptions", "(Lcom/facebook/react/bridge/ReadableMap;Lcom/facebook/react/bridge/Callback;Lcom/facebook/react/bridge/Callback;)V", args, count); | |
~~~~~~~~~~~~~~~~~~~~~~~~~~~~~~~~~~~~~~~~~~~~~~~~~~~~~~~~~~~~ ^ | |
/Users/vojta/_dev/_own/document-picker/node_modules/react-native/ReactCommon/react/nativemodule/core/platform/android/ReactCommon/JavaTurboModule.h:47:3: note: 'invokeJavaMethod' declared here | |
jsi::Value invokeJavaMethod( | |
^ | |
fatal error: too many errors emitted, stopping now [-ferror-limit=] | |
20 errors generated. | |
[17/167] Linking CXX shared library /Users/vojta/_dev/_own/document-picker/node_modules/react-native/ReactAndroid/build/intermediates/cxx/Debug/3d5q5820/obj/arm64-v8a/libreact_render_debug.so | |
[18/167] Building CXX object ReactCommon/react/renderer/imagemanager/CMakeFiles/react_render_imagemanager.dir/ImageTelemetry.cpp.o | |
[19/167] Building CXX object ReactCommon/react/renderer/components/unimplementedview/CMakeFiles/rrc_unimplementedview.dir/UnimplementedViewShadowNode.cpp.o | |
[20/167] Building CXX object ReactCommon/react/renderer/components/text/CMakeFiles/rrc_text.dir/ParagraphShadowNode.cpp.o | |
[21/167] Building CXX object ReactCommon/react/renderer/imagemanager/CMakeFiles/react_render_imagemanager.dir/platform/cxx/react/renderer/imagemanager/ImageManager.cpp.o | |
[22/167] Building CXX object ReactCommon/react/renderer/imagemanager/CMakeFiles/react_render_imagemanager.dir/platform/cxx/react/renderer/imagemanager/ImageRequest.cpp.o | |
[23/167] Building CXX object ReactCommon/react/renderer/components/view/CMakeFiles/rrc_view.dir/PointerEvent.cpp.o | |
[24/167] Building CXX object ReactCommon/react/renderer/components/view/CMakeFiles/rrc_view.dir/Touch.cpp.o | |
[25/167] Building CXX object ReactCommon/react/renderer/components/view/CMakeFiles/rrc_view.dir/TouchEvent.cpp.o | |
[26/167] Building CXX object ReactCommon/react/renderer/components/view/CMakeFiles/rrc_view.dir/TouchEventEmitter.cpp.o | |
[27/167] Building CXX object ReactCommon/react/renderer/components/view/CMakeFiles/rrc_view.dir/AccessibilityProps.cpp.o | |
ninja: build stopped: subcommand failed. | |
* Try: | |
> Run with --stacktrace option to get the stack trace. | |
> Run with --info or --debug option to get more log output. | |
> Run with --scan to get full insights. | |
* Get more help at https://help.gradle.org | |
BUILD FAILED in 17s | |
at makeError (/Users/vojta/_dev/_own/document-picker/node_modules/execa/index.js:174:9) | |
at /Users/vojta/_dev/_own/document-picker/node_modules/execa/index.js:278:16 | |
at processTicksAndRejections (node:internal/process/task_queues:96:5) | |
at async runOnAllDevices (/Users/vojta/_dev/_own/document-picker/node_modules/@react-native-community/cli-platform-android/build/commands/runAndroid/runOnAllDevices.js:109:5) | |
at async Command.handleAction (/Users/vojta/_dev/_own/document-picker/node_modules/@react-native-community/cli/build/index.js:142:9) | |
info Run CLI with --verbose flag for more details. |
Sign up for free
to join this conversation on GitHub.
Already have an account?
Sign in to comment